{"text_format":"1","workbook":"xlsx","n_sheets":22,"sheets":["Portada","Instrucciones","GastosIngresos","Hoja1","phpBB","Plantilla","Inscripciones","General","Regularidad","Montana","Etapas","Consulta de Inscripciones","Consulta Corredor","Consulta General","Consulta Regularidad","Consulta Montana","Precios Carreras","Premios Carreras","Tipos de Corredor","Version","Meses","Sucio"],"not_rendered":{"charts":0,"images":28,"macros":1,"external_links":0,"defined_names":10,"comments":0,"pivot_tables":0},"unopened":[],"bounds":{"document_bytes":16777216,"sheet_cells":100000,"rows_first":2000,"rows_last":500,"rows_between":2000,"halvings":0,"cell_chars":16384,"cell_head_chars":4096},"cells_cut":0,"cells_raw":0,"read":"whole","date_system":"1900"}

{"sheet":"Portada","index":0,"n_rows":22,"n_cols":8,"rows_kept":22,"cut":false,"hidden":false,"merged":[[1,2,3,9],[6,2,7,4],[6,5,7,9],[10,5,10,6],[21,7,24,10]]}
[]
[null,null,"PCM Fantasy Planner 2013"]
[]
[]
[]
[]
[null,null,"Nombre del equipo:",null,null,"Renfe Pro Cycling Team"]
[]
[]
[]
[null,null,null,null,null,"Pegue aquí su logotipo\n(max 151x212)"]
[]
[]
[]
[]
[]
[]
[]
[]
[]
[]
[null,null,null,null,null,null,null,"Jorge García Samartín\nGeorgus\nwww.gsamartin.es"]

{"sheet":"Instrucciones","index":1,"n_rows":47,"n_cols":2,"rows_kept":47,"cut":false,"hidden":false,"merged":[[22,1,22,8],[26,1,26,4],[28,1,31,8],[7,1,10,8],[12,1,13,8],[14,1,16,8],[19,1,21,8],[18,1,18,8],[44,1,44,4],[46,1,46,8],[40,1,40,4],[42,1,42,8],[33,1,33,4],[35,1,37,8],[38,1,38,8]]}
[]
[]
[]
[]
[null,"Hola, esta hoja está hecha para planificar de forma más sencilla la temporada "]
[]
[null,"Instrucciones"]
[null,"A la izquierda está situado el menú de navegación, que le llevará por las distintas hojas y opciones. Esta hoja se llama \"Instrucciones\" y es la unica que permite volver a la portada para cambiar la configuracion básica del equipo."]
[]
[]
[]
[null,"La hoja Plantilla le permitirá configurar su plantilla, sus años de contrato…"]
[null,"La ficha de Finanzas es semi-automática (solo hay que meter presupuesto del patrcoinador e Ingresos/Gastos varios) y cuenta con un visor phpBB para que sea muy facil copiar y pegar en foros."]
[]
[null,"El logo            permite inscribir corredores y sus logros, que podrá consultar individualmente haciendo click en el icono          . Si desea ver que corredores ha inscrito para una carrera determinada, haga click en            . "]
[]
[]
[null,"La hoja de Etapas no es automática por ahora, tendrá que rellenar los ingresos por etapas."]
[null,"La hoja Excel está bloqueada, para no desconfigurarla erroneamente, pero no tiene contraseña, con lo que la podéis desbloquear facilmente, aunque en principio no haría falta."]
[null,"Por último, decir que la presente hoja está bajo Licencia Creative Commons Reconocimiento-NoComercial-CompartirIgual y que puede compartirla y retocarla siempre que no sea de modo comercial y me pongais como autor (click en Licencia para más info)."]
[]
[]
[null,"¡Que la disfrutéis!"]
[]
[null,"Versiones"]
[]
[null,"Versión 1.0.0-2013 (27 de Enero de 2013)"]
[]
[null,"Permite la inscripción a carreras e introducción de logros, salvo etapas.Es posible consultarlos corredor por corredor, además de carrera por carrera en el caso de las inscripciones La hoja Finanzas es automática y tiene un visor de phpBB code. Deja introducir el logo del equipo. Licencia Creative Commons Reconocimiento-NoComercial-CompartirIgual"]
[]
[]
[]
[]
[null,"Versión 1.1.0-2013 (30 de Enero de 2013)"]
[]
[null,"Se han corregido algunos errores de bloqueo de celdas, que estaban bloqueadas cuando no tenian que estarlo. Se ha corregido también un error que impedia inscribir correctamente a los ciclistas a algunas carreras."]
[]
[]
[null,"Además, tras algunas pruebas he pensado en cambiar la forma de visualizar los presupuestos y ahora es más cómoda y sencilla"]
[]
[null,"Versión 1.1.5-2013 (1 de Febrero de 2013)"]
[]
[null,"Corregido un error en las finanzas"]
[]
[null,"Versión 1.5.0-2013 (26 de Agosto de 2013)"]
[]
[null,"Actualizado completamente para el nuevo Fantasy. Corrección de pequeños errores"]

{"sheet":"GastosIngresos","index":2,"n_rows":403,"n_cols":57,"rows_kept":403,"cut":false,"hidden":false,"merged":[]}
[null,null,1,2,3,4,5,6,7,8,9,10,11,12,13,14,15,16,17,18,19,20,21,22,23,24,25,26,27,28,29,30,31,32,33,34,35,36,37,38,39,40,41,42,43,44,45,46,47,48,49,50,51,52,53,54,"Total"]
["Enero","E",{"$f":"IF(Inscripciones!C$3=GastosIngresos!$B2,Inscripciones!C$41,\"\")","v":""},{"$f":"IF(Inscripciones!D$3=GastosIngresos!$B2,Inscripciones!D$41,\"\")","v":""},{"$f":"IF(Inscripciones!E$3=GastosIngresos!$B2,Inscripciones!E$41,\"\")","v":""},{"$f":"IF(Inscripciones!F$3=GastosIngresos!$B2,Inscripciones!F$41,\"\")","v":""},{"$f":"IF(Inscripciones!G$3=GastosIngresos!$B2,Inscripciones!G$41,\"\")","v":""},{"$f":"IF(Inscripciones!H$3=GastosIngresos!$B2,Inscripciones!H$41,\"\")","v":""},{"$f":"IF(Inscripciones!I$3=GastosIngresos!$B2,Inscripciones!I$41,\"\")","v":""},{"$f":"IF(Inscripciones!J$3=GastosIngresos!$B2,Inscripciones!J$41,\"\")","v":""},{"$f":"IF(Inscripciones!K$3=GastosIngresos!$B2,Inscripciones!K$41,\"\")","v":""},{"$f":"IF(Inscripciones!L$3=GastosIngresos!$B2,Inscripciones!L$41,\"\")","v":""},{"$f":"IF(Inscripciones!M$3=GastosIngresos!$B2,Inscripciones!M$41,\"\")","v":""},{"$f":"IF(Inscripciones!N$3=GastosIngresos!$B2,Inscripciones!N$41,\"\")","v":""},{"$f":"IF(Inscripciones!O$3=GastosIngresos!$B2,Inscripciones!O$41,\"\")","v":""},{"$f":"IF(Inscripciones!P$3=GastosIngresos!$B2,Inscripciones!P$41,\"\")","v":""},{"$f":"IF(Inscripciones!Q$3=GastosIngresos!$B2,Inscripciones!Q$41,\"\")","v":""},{"$f":"IF(Inscripciones!R$3=GastosIngresos!$B2,Inscripciones!R$41,\"\")","v":""},{"$f":"IF(Inscripciones!S$3=GastosIngresos!$B2,Inscripciones!S$41,\"\")","v":""},{"$f":"IF(Inscripciones!T$3=GastosIngresos!$B2,Inscripciones!T$41,\"\")","v":""},{"$f":"IF(Inscripciones!U$3=GastosIngresos!$B2,Inscripciones!U$41,\"\")","v":""},{"$f":"IF(Inscripciones!V$3=GastosIngresos!$B2,Inscripciones!V$41,\"\")","v":""},{"$f":"IF(Inscripciones!W$3=GastosIngresos!$B2,Inscripciones!W$41,\"\")","v":""},{"$f":"IF(Inscripciones!X$3=GastosIngresos!$B2,Inscripciones!X$41,\"\")","v":""},{"$f":"IF(Inscripciones!Y$3=GastosIngresos!$B2,Inscripciones!Y$41,\"\")","v":""},{"$f":"IF(Inscripciones!Z$3=GastosIngresos!$B2,Inscripciones!Z$41,\"\")","v":""},{"$f":"IF(Inscripciones!AA$3=GastosIngresos!$B2,Inscripciones!AA$41,\"\")","v":""},{"$f":"IF(Inscripciones!AB$3=GastosIngresos!$B2,Inscripciones!AB$41,\"\")","v":""},{"$f":"IF(Inscripciones!AC$3=GastosIngresos!$B2,Inscripciones!AC$41,\"\")","v":""},{"$f":"IF(Inscripciones!AD$3=GastosIngresos!$B2,Inscripciones!AD$41,\"\")","v":""},{"$f":"IF(Inscripciones!AE$3=GastosIngresos!$B2,Inscripciones!AE$41,\"\")","v":""},{"$f":"IF(Inscripciones!AF$3=GastosIngresos!$B2,Inscripciones!AF$41,\"\")","v":""},{"$f":"IF(Inscripciones!AG$3=GastosIngresos!$B2,Inscripciones!AG$41,\"\")","v":""},{"$f":"IF(Inscripciones!AH$3=GastosIngresos!$B2,Inscripciones!AH$41,\"\")","v":""},{"$f":"IF(Inscripciones!AI$3=GastosIngresos!$B2,Inscripciones!AI$41,\"\")","v":""},{"$f":"IF(Inscripciones!AJ$3=GastosIngresos!$B2,Inscripciones!AJ$41,\"\")","v":""},{"$f":"IF(Inscripciones!AK$3=GastosIngresos!$B2,Inscripciones!AK$41,\"\")","v":""},{"$f":"IF(Inscripciones!AL$3=GastosIngresos!$B2,Inscripciones!AL$41,\"\")","v":""},{"$f":"IF(Inscripciones!AM$3=GastosIngresos!$B2,Inscripciones!AM$41,\"\")","v":""},{"$f":"IF(Inscripciones!AN$3=GastosIngresos!$B2,Inscripciones!AN$41,\"\")","v":""},{"$f":"IF(Inscripciones!AO$3=GastosIngresos!$B2,Inscripciones!AO$41,\"\")","v":""},{"$f":"IF(Inscripciones!AP$3=GastosIngresos!$B2,Inscripciones!AP$41,\"\")","v":""},{"$f":"IF(Inscripciones!AQ$3=GastosIngresos!$B2,Inscripciones!AQ$41,\"\")","v":""},{"$f":"IF(Inscripciones!AR$3=GastosIngresos!$B2,Inscripciones!AR$41,\"\")","v":""},{"$f":"IF(Inscripciones!AS$3=GastosIngresos!$B2,Inscripciones!AS$41,\"\")","v":""},{"$f":"IF(Inscripciones!AT$3=GastosIngresos!$B2,Inscripciones!AT$41,\"\")","v":""},{"$f":"IF(Inscripciones!AU$3=GastosIngresos!$B2,Inscripciones!AU$41,\"\")","v":""},{"$f":"IF(Inscripciones!AV$3=GastosIngresos!$B2,Inscripciones!AV$41,\"\")","v":""},{"$f":"IF(Inscripciones!AW$3=GastosIngresos!$B2,Inscripciones!AW$41,\"\")","v":""},{"$f":"IF(Inscripciones!AX$3=GastosIngresos!$B2,Inscripciones!AX$41,\"\")","v":""},{"$f":"IF(Inscripciones!AY$3=GastosIngresos!$B2,Inscripciones!AY$41,\"\")","v":""},{"$f":"IF(Inscripciones!AZ$3=GastosIngresos!$B2,Inscripciones!AZ$41,\"\")","v":""},{"$f":"IF(Inscripciones!BA$3=GastosIngresos!$B2,Inscripciones!BA$41,\"\")","v":""},{"$f":"IF(Inscripciones!BB$3=GastosIngresos!$B2,Inscripciones!BB$41,\"\")","v":""},{"$f":"IF(Inscripciones!BC$3=GastosIngresos!$B2,Inscripciones!BC$41,\"\")","v":""},{"$f":"IF(Inscripciones!BD$3=GastosIngresos!$B2,Inscripciones!BD$41,\"\")","v":""},{"$f":"SUM(C2:BD2)","v":0}]
["Febrero","F",{"$f":"IF(Inscripciones!C$3=GastosIngresos!$B3,Inscripciones!C$41,\"\")","v":""},{"$f":"IF(Inscripciones!D$3=GastosIngresos!$B3,Inscripciones!D$41,\"\")","v":""},{"$f":"IF(Inscripciones!E$3=GastosIngresos!$B3,Inscripciones!E$41,\"\")","v":""},{"$f":"IF(Inscripciones!F$3=GastosIngresos!$B3,Inscripciones!F$41,\"\")","v":""},{"$f":"IF(Inscripciones!G$3=GastosIngresos!$B3,Inscripciones!G$41,\"\")","v":""},{"$f":"IF(Inscripciones!H$3=GastosIngresos!$B3,Inscripciones!H$41,\"\")","v":""},{"$f":"IF(Inscripciones!I$3=GastosIngresos!$B3,Inscripciones!I$41,\"\")","v":""},{"$f":"IF(Inscripciones!J$3=GastosIngresos!$B3,Inscripciones!J$41,\"\")","v":""},{"$f":"IF(Inscripciones!K$3=GastosIngresos!$B3,Inscripciones!K$41,\"\")","v":""},{"$f":"IF(Inscripciones!L$3=GastosIngresos!$B3,Inscripciones!L$41,\"\")","v":""},{"$f":"IF(Inscripciones!M$3=GastosIngresos!$B3,Inscripciones!M$41,\"\")","v":""},{"$f":"IF(Inscripciones!N$3=GastosIngresos!$B3,Inscripciones!N$41,\"\")","v":""},{"$f":"IF(Inscripciones!O$3=GastosIngresos!$B3,Inscripciones!O$41,\"\")","v":""},{"$f":"IF(Inscripciones!P$3=GastosIngresos!$B3,Inscripciones!P$41,\"\")","v":""},{"$f":"IF(Inscripciones!Q$3=GastosIngresos!$B3,Inscripciones!Q$41,\"\")","v":""},{"$f":"IF(Inscripciones!R$3=GastosIngresos!$B3,Inscripciones!R$41,\"\")","v":""},{"$f":"IF(Inscripciones!S$3=GastosIngresos!$B3,Inscripciones!S$41,\"\")","v":""},{"$f":"IF(Inscripciones!T$3=GastosIngresos!$B3,Inscripciones!T$41,\"\")","v":""},{"$f":"IF(Inscripciones!U$3=GastosIngresos!$B3,Inscripciones!U$41,\"\")","v":""},{"$f":"IF(Inscripciones!V$3=GastosIngresos!$B3,Inscripciones!V$41,\"\")","v":""},{"$f":"IF(Inscripciones!W$3=GastosIngresos!$B3,Inscripciones!W$41,\"\")","v":""},{"$f":"IF(Inscripciones!X$3=GastosIngresos!$B3,Inscripciones!X$41,\"\")","v":""},{"$f":"IF(Inscripciones!Y$3=GastosIngresos!$B3,Inscripciones!Y$41,\"\")","v":""},{"$f":"IF(Inscripciones!Z$3=GastosIngresos!$B3,Inscripciones!Z$41,\"\")","v":""},{"$f":"IF(Inscripciones!AA$3=GastosIngresos!$B3,Inscripciones!AA$41,\"\")","v":""},{"$f":"IF(Inscripciones!AB$3=GastosIngresos!$B3,Inscripciones!AB$41,\"\")","v":""},{"$f":"IF(Inscripciones!AC$3=GastosIngresos!$B3,Inscripciones!AC$41,\"\")","v":""},{"$f":"IF(Inscripciones!AD$3=GastosIngresos!$B3,Inscripciones!AD$41,\"\")","v":""},{"$f":"IF(Inscripciones!AE$3=GastosIngresos!$B3,Inscripciones!AE$41,\"\")","v":""},{"$f":"IF(Inscripciones!AF$3=GastosIngresos!$B3,Inscripciones!AF$41,\"\")","v":""},{"$f":"IF(Inscripciones!AG$3=GastosIngresos!$B3,Inscripciones!AG$41,\"\")","v":""},{"$f":"IF(Inscripciones!AH$3=GastosIngresos!$B3,Inscripciones!AH$41,\"\")","v":""},{"$f":"IF(Inscripciones!AI$3=GastosIngresos!$B3,Inscripciones!AI$41,\"\")","v":""},{"$f":"IF(Inscripciones!AJ$3=GastosIngresos!$B3,Inscripciones!AJ$41,\"\")","v":""},{"$f":"IF(Inscripciones!AK$3=GastosIngresos!$B3,Inscripciones!AK$41,\"\")","v":""},{"$f":"IF(Inscripciones!AL$3=GastosIngresos!$B3,Inscripciones!AL$41,\"\")","v":""},{"$f":"IF(Inscripciones!AM$3=GastosIngresos!$B3,Inscripciones!AM$41,\"\")","v":""},{"$f":"IF(Inscripciones!AN$3=GastosIngresos!$B3,Inscripciones!AN$41,\"\")","v":""},{"$f":"IF(Inscripciones!AO$3=GastosIngresos!$B3,Inscripciones!AO$41,\"\")","v":""},{"$f":"IF(Inscripciones!AP$3=GastosIngresos!$B3,Inscripciones!AP$41,\"\")","v":""},{"$f":"IF(Inscripciones!AQ$3=GastosIngresos!$B3,Inscripciones!AQ$41,\"\")","v":""},{"$f":"IF(Inscripciones!AR$3=GastosIngresos!$B3,Inscripciones!AR$41,\"\")","v":""},{"$f":"IF(Inscripciones!AS$3=GastosIngresos!$B3,Inscripciones!AS$41,\"\")","v":""},{"$f":"IF(Inscripciones!AT$3=GastosIngresos!$B3,Inscripciones!AT$41,\"\")","v":""},{"$f":"IF(Inscripciones!AU$3=GastosIngresos!$B3,Inscripciones!AU$41,\"\")","v":""},{"$f":"IF(Inscripciones!AV$3=GastosIngresos!$B3,Inscripciones!AV$41,\"\")","v":""},{"$f":"IF(Inscripciones!AW$3=GastosIngresos!$B3,Inscripciones!AW$41,\"\")","v":""},{"$f":"IF(Inscripciones!AX$3=GastosIngresos!$B3,Inscripciones!AX$41,\"\")","v":""},{"$f":"IF(Inscripciones!AY$3=GastosIngresos!$B3,Inscripciones!AY$41,\"\")","v":""},{"$f":"IF(Inscripciones!AZ$3=GastosIngresos!$B3,Inscripciones!AZ$41,\"\")","v":""},{"$f":"IF(Inscripciones!BA$3=GastosIngresos!$B3,Inscripciones!BA$41,\"\")","v":""},{"$f":"IF(Inscripciones!BB$3=GastosIngresos!$B3,Inscripciones!BB$41,\"\")","v":""},{"$f":"IF(Inscripciones!BC$3=GastosIngresos!$B3,Inscripciones!BC$41,\"\")","v":""},{"$f":"IF(Inscripciones!BD$3=GastosIngresos!$B3,Inscripciones!BD$41,\"\")","v":""},{"$f":"SUM(C3:BD3)","v":0}]
["Marzo","M",{"$f":"IF(Inscripciones!C$3=GastosIngresos!$B4,Inscripciones!C$41,\"\")","v":""},{"$f":"IF(Inscripciones!D$3=GastosIngresos!$B4,Inscripciones!D$41,\"\")","v":""},{"$f":"IF(Inscripciones!E$3=GastosIngresos!$B4,Inscripciones!E$41,\"\")","v":""},{"$f":"IF(Inscripciones!F$3=GastosIngresos!$B4,Inscripciones!F$41,\"\")","v":""},{"$f":"IF(Inscripciones!G$3=GastosIngresos!$B4,Inscripciones!G$41,\"\")","v":""},{"$f":"IF(Inscripciones!H$3=GastosIngresos!$B4,Inscripciones!H$41,\"\")","v":""},{"$f":"IF(Inscripciones!I$3=GastosIngresos!$B4,Inscripciones!I$41,\"\")","v":""},{"$f":"IF(Inscripciones!J$3=GastosIngresos!$B4,Inscripciones!J$41,\"\")","v":""},{"$f":"IF(Inscripciones!K$3=GastosIngresos!$B4,Inscripciones!K$41,\"\")","v":""},{"$f":"IF(Inscripciones!L$3=GastosIngresos!$B4,Inscripciones!L$41,\"\")","v":""},{"$f":"IF(Inscripciones!M$3=GastosIngresos!$B4,Inscripciones!M$41,\"\")","v":""},{"$f":"IF(Inscripciones!N$3=GastosIngresos!$B4,Inscripciones!N$41,\"\")","v":""},{"$f":"IF(Inscripciones!O$3=GastosIngresos!$B4,Inscripciones!O$41,\"\")","v":""},{"$f":"IF(Inscripciones!P$3=GastosIngresos!$B4,Inscripciones!P$41,\"\")","v":""},{"$f":"IF(Inscripciones!Q$3=GastosIngresos!$B4,Inscripciones!Q$41,\"\")","v":""},{"$f":"IF(Inscripciones!R$3=GastosIngresos!$B4,Inscripciones!R$41,\"\")","v":""},{"$f":"IF(Inscripciones!S$3=GastosIngresos!$B4,Inscripciones!S$41,\"\")","v":""},{"$f":"IF(Inscripciones!T$3=GastosIngresos!$B4,Inscripciones!T$41,\"\")","v":""},{"$f":"IF(Inscripciones!U$3=GastosIngresos!$B4,Inscripciones!U$41,\"\")","v":""},{"$f":"IF(Inscripciones!V$3=GastosIngresos!$B4,Inscripciones!V$41,\"\")","v":""},{"$f":"IF(Inscripciones!W$3=GastosIngresos!$B4,Inscripciones!W$41,\"\")","v":""},{"$f":"IF(Inscripciones!X$3=GastosIngresos!$B4,Inscripciones!X$41,\"\")","v":""},{"$f":"IF(Inscripciones!Y$3=GastosIngresos!$B4,Inscripciones!Y$41,\"\")","v":""},{"$f":"IF(Inscripciones!Z$3=GastosIngresos!$B4,Inscripciones!Z$41,\"\")","v":""},{"$f":"IF(Inscripciones!AA$3=GastosIngresos!$B4,Inscripciones!AA$41,\"\")","v":""},{"$f":"IF(Inscripciones!AB$3=GastosIngresos!$B4,Inscripciones!AB$41,\"\")","v":""},{"$f":"IF(Inscripciones!AC$3=GastosIngresos!$B4,Inscripciones!AC$41,\"\")","v":""},{"$f":"IF(Inscripciones!AD$3=GastosIngresos!$B4,Inscripciones!AD$41,\"\")","v":""},{"$f":"IF(Inscripciones!AE$3=GastosIngresos!$B4,Inscripciones!AE$41,\"\")","v":""},{"$f":"IF(Inscripciones!AF$3=GastosIngresos!$B4,Inscripciones!AF$41,\"\")","v":""},{"$f":"IF(Inscripciones!AG$3=GastosIngresos!$B4,Inscripciones!AG$41,\"\")","v":""},{"$f":"IF(Inscripciones!AH$3=GastosIngresos!$B4,Inscripciones!AH$41,\"\")","v":""},{"$f":"IF(Inscripciones!AI$3=GastosIngresos!$B4,Inscripciones!AI$41,\"\")","v":""},{"$f":"IF(Inscripciones!AJ$3=GastosIngresos!$B4,Inscripciones!AJ$41,\"\")","v":""},{"$f":"IF(Inscripciones!AK$3=GastosIngresos!$B4,Inscripciones!AK$41,\"\")","v":""},{"$f":"IF(Inscripciones!AL$3=GastosIngresos!$B4,Inscripciones!AL$41,\"\")","v":""},{"$f":"IF(Inscripciones!AM$3=GastosIngresos!$B4,Inscripciones!AM$41,\"\")","v":""},{"$f":"IF(Inscripciones!AN$3=GastosIngresos!$B4,Inscripciones!AN$41,\"\")","v":""},{"$f":"IF(Inscripciones!AO$3=GastosIngresos!$B4,Inscripciones!AO$41,\"\")","v":""},{"$f":"IF(Inscripciones!AP$3=GastosIngresos!$B4,Inscripciones!AP$41,\"\")","v":""},{"$f":"IF(Inscripciones!AQ$3=GastosIngresos!$B4,Inscripciones!AQ$41,\"\")","v":""},{"$f":"IF(Inscripciones!AR$3=GastosIngresos!$B4,Inscripciones!AR$41,\"\")","v":""},{"$f":"IF(Inscripciones!AS$3=GastosIngresos!$B4,Inscripciones!AS$41,\"\")","v":""},{"$f":"IF(Inscripciones!AT$3=GastosIngresos!$B4,Inscripciones!AT$41,\"\")","v":""},{"$f":"IF(Inscripciones!AU$3=GastosIngresos!$B4,Inscripciones!AU$41,\"\")","v":""},{"$f":"IF(Inscripciones!AV$3=GastosIngresos!$B4,Inscripciones!AV$41,\"\")","v":""},{"$f":"IF(Inscripciones!AW$3=GastosIngresos!$B4,Inscripciones!AW$41,\"\")","v":""},{"$f":"IF(Inscripciones!AX$3=GastosIngresos!$B4,Inscripciones!AX$41,\"\")","v":""},{"$f":"IF(Inscripciones!AY$3=GastosIngresos!$B4,Inscripciones!AY$41,\"\")","v":""},{"$f":"IF(Inscripciones!AZ$3=GastosIngresos!$B4,Inscripciones!AZ$41,\"\")","v":""},{"$f":"IF(Inscripciones!BA$3=GastosIngresos!$B4,Inscripciones!BA$41,\"\")","v":""},{"$f":"IF(Inscripciones!BB$3=GastosIngresos!$B4,Inscripciones!BB$41,\"\")","v":""},{"$f":"IF(Inscripciones!BC$3=GastosIngresos!$B4,Inscripciones!BC$41,\"\")","v":""},{"$f":"IF(Inscripciones!BD$3=GastosIngresos!$B4,Inscripciones!BD$41,\"\")","v":""},0]
["Abril","A",{"$f":"IF(Inscripciones!C$3=GastosIngresos!$B5,Inscripciones!C$41,\"\")","v":""},{"$f":"IF(Inscripciones!D$3=GastosIngresos!$B5,Inscripciones!D$41,\"\")","v":""},{"$f":"IF(Inscripciones!E$3=GastosIngresos!$B5,Inscripciones!E$41,\"\")","v":""},{"$f":"IF(Inscripciones!F$3=GastosIngresos!$B5,Inscripciones!F$41,\"\")","v":""},{"$f":"IF(Inscripciones!G$3=GastosIngresos!$B5,Inscripciones!G$41,\"\")","v":""},{"$f":"IF(Inscripciones!H$3=GastosIngresos!$B5,Inscripciones!H$41,\"\")","v":""},{"$f":"IF(Inscripciones!I$3=GastosIngresos!$B5,Inscripciones!I$41,\"\")","v":""},{"$f":"IF(Inscripciones!J$3=GastosIngresos!$B5,Inscripciones!J$41,\"\")","v":""},{"$f":"IF(Inscripciones!K$3=GastosIngresos!$B5,Inscripciones!K$41,\"\")","v":""},{"$f":"IF(Inscripciones!L$3=GastosIngresos!$B5,Inscripciones!L$41,\"\")","v":""},{"$f":"IF(Inscripciones!M$3=GastosIngresos!$B5,Inscripciones!M$41,\"\")","v":""},{"$f":"IF(Inscripciones!N$3=GastosIngresos!$B5,Inscripciones!N$41,\"\")","v":""},{"$f":"IF(Inscripciones!O$3=GastosIngresos!$B5,Inscripciones!O$41,\"\")","v":""},{"$f":"IF(Inscripciones!P$3=GastosIngresos!$B5,Inscripciones!P$41,\"\")","v":""},{"$f":"IF(Inscripciones!Q$3=GastosIngresos!$B5,Inscripciones!Q$41,\"\")","v":""},{"$f":"IF(Inscripciones!R$3=GastosIngresos!$B5,Inscripciones!R$41,\"\")","v":""},{"$f":"IF(Inscripciones!S$3=GastosIngresos!$B5,Inscripciones!S$41,\"\")","v":""},{"$f":"IF(Inscripciones!T$3=GastosIngresos!$B5,Inscripciones!T$41,\"\")","v":""},{"$f":"IF(Inscripciones!U$3=GastosIngresos!$B5,Inscripciones!U$41,\"\")","v":""},{"$f":"IF(Inscripciones!V$3=GastosIngresos!$B5,Inscripciones!V$41,\"\")","v":""},{"$f":"IF(Inscripciones!W$3=GastosIngresos!$B5,Inscripciones!W$41,\"\")","v":""},{"$f":"IF(Inscripciones!X$3=GastosIngresos!$B5,Inscripciones!X$41,\"\")","v":""},{"$f":"IF(Inscripciones!Y$3=GastosIngresos!$B5,Inscripciones!Y$41,\"\")","v":""},{"$f":"IF(Inscripciones!Z$3=GastosIngresos!$B5,Inscripciones!Z$41,\"\")","v":""},{"$f":"IF(Inscripciones!AA$3=GastosIngresos!$B5,Inscripciones!AA$41,\"\")","v":""},{"$f":"IF(Inscripciones!AB$3=GastosIngresos!$B5,Inscripciones!AB$41,\"\")","v":""},{"$f":"IF(Inscripciones!AC$3=GastosIngresos!$B5,Inscripciones!AC$41,\"\")","v":""},{"$f":"IF(Inscripciones!AD$3=GastosIngresos!$B5,Inscripciones!AD$41,\"\")","v":""},{"$f":"IF(Inscripciones!AE$3=GastosIngresos!$B5,Inscripciones!AE$41,\"\")","v":""},{"$f":"IF(Inscripciones!AF$3=GastosIngresos!$B5,Inscripciones!AF$41,\"\")","v":""},{"$f":"IF(Inscripciones!AG$3=GastosIngresos!$B5,Inscripciones!AG$41,\"\")","v":""},{"$f":"IF(Inscripciones!AH$3=GastosIngresos!$B5,Inscripciones!AH$41,\"\")","v":""},{"$f":"IF(Inscripciones!AI$3=GastosIngresos!$B5,Inscripciones!AI$41,\"\")","v":""},{"$f":"IF(Inscripciones!AJ$3=GastosIngresos!$B5,Inscripciones!AJ$41,\"\")","v":""},{"$f":"IF(Inscripciones!AK$3=GastosIngresos!$B5,Inscripciones!AK$41,\"\")","v":""},{"$f":"IF(Inscripciones!AL$3=GastosIngresos!$B5,Inscripciones!AL$41,\"\")","v":""},{"$f":"IF(Inscripciones!AM$3=GastosIngresos!$B5,Inscripciones!AM$41,\"\")","v":""},{"$f":"IF(Inscripciones!AN$3=GastosIngresos!$B5,Inscripciones!AN$41,\"\")","v":""},{"$f":"IF(Inscripciones!AO$3=GastosIngresos!$B5,Inscripciones!AO$41,\"\")","v":""},{"$f":"IF(Inscripciones!AP$3=GastosIngresos!$B5,Inscripciones!AP$41,\"\")","v":""},{"$f":"IF(Inscripciones!AQ$3=GastosIngresos!$B5,Inscripciones!AQ$41,\"\")","v":""},{"$f":"IF(Inscripciones!AR$3=GastosIngresos!$B5,Inscripciones!AR$41,\"\")","v":""},{"$f":"IF(Inscripciones!AS$3=GastosIngresos!$B5,Inscripciones!AS$41,\"\")","v":""},{"$f":"IF(Inscripciones!AT$3=GastosIngresos!$B5,Inscripciones!AT$41,\"\")","v":""},{"$f":"IF(Inscripciones!AU$3=GastosIngresos!$B5,Inscripciones!AU$41,\"\")","v":""},{"$f":"IF(Inscripciones!AV$3=GastosIngresos!$B5,Inscripciones!AV$41,\"\")","v":""},{"$f":"IF(Inscripciones!AW$3=GastosIngresos!$B5,Inscripciones!AW$41,\"\")","v":""},{"$f":"IF(Inscripciones!AX$3=GastosIngresos!$B5,Inscripciones!AX$41,\"\")","v":""},{"$f":"IF(Inscripciones!AY$3=GastosIngresos!$B5,Inscripciones!AY$41,\"\")","v":""},{"$f":"IF(Inscripciones!AZ$3=GastosIngresos!$B5,Inscripciones!AZ$41,\"\")","v":""},{"$f":"IF(Inscripciones!BA$3=GastosIngresos!$B5,Inscripciones!BA$41,\"\")","v":""},{"$f":"IF(Inscripciones!BB$3=GastosIngresos!$B5,Inscripciones!BB$41,\"\")","v":""},{"$f":"IF(Inscripciones!BC$3=GastosIngresos!$B5,Inscripciones!BC$41,\"\")","v":""},{"$f":"IF(Inscripciones!BD$3=GastosIngresos!$B5,Inscripciones!BD$41,\"\")","v":""},0]
["Mayo","My",{"$f":"IF(Inscripciones!C$3=GastosIngresos!$B6,Inscripciones!C$41,\"\")","v":""},{"$f":"IF(Inscripciones!D$3=GastosIngresos!$B6,Inscripciones!D$41,\"\")","v":""},{"$f":"IF(Inscripciones!E$3=GastosIngresos!$B6,Inscripciones!E$41,\"\")","v":""},{"$f":"IF(Inscripciones!F$3=GastosIngresos!$B6,Inscripciones!F$41,\"\")","v":""},{"$f":"IF(Inscripciones!G$3=GastosIngresos!$B6,Inscripciones!G$41,\"\")","v":""},{"$f":"IF(Inscripciones!H$3=GastosIngresos!$B6,Inscripciones!H$41,\"\")","v":""},{"$f":"IF(Inscripciones!I$3=GastosIngresos!$B6,Inscripciones!I$41,\"\")","v":""},{"$f":"IF(Inscripciones!J$3=GastosIngresos!$B6,Inscripciones!J$41,\"\")","v":""},{"$f":"IF(Inscripciones!K$3=GastosIngresos!$B6,Inscripciones!K$41,\"\")","v":""},{"$f":"IF(Inscripciones!L$3=GastosIngresos!$B6,Inscripciones!L$41,\"\")","v":""},{"$f":"IF(Inscripciones!M$3=GastosIngresos!$B6,Inscripciones!M$41,\"\")","v":""},{"$f":"IF(Inscripciones!N$3=GastosIngresos!$B6,Inscripciones!N$41,\"\")","v":""},{"$f":"IF(Inscripciones!O$3=GastosIngresos!$B6,Inscripciones!O$41,\"\")","v":""},{"$f":"IF(Inscripciones!P$3=GastosIngresos!$B6,Inscripciones!P$41,\"\")","v":""},{"$f":"IF(Inscripciones!Q$3=GastosIngresos!$B6,Inscripciones!Q$41,\"\")","v":""},{"$f":"IF(Inscripciones!R$3=GastosIngresos!$B6,Inscripciones!R$41,\"\")","v":""},{"$f":"IF(Inscripciones!S$3=GastosIngresos!$B6,Inscripciones!S$41,\"\")","v":""},{"$f":"IF(Inscripciones!T$3=GastosIngresos!$B6,Inscripciones!T$41,\"\")","v":""},{"$f":"IF(Inscripciones!U$3=GastosIngresos!$B6,Inscripciones!U$41,\"\")","v":""},{"$f":"IF(Inscripciones!V$3=GastosIngresos!$B6,Inscripciones!V$41,\"\")","v":""},{"$f":"IF(Inscripciones!W$3=GastosIngresos!$B6,Inscripciones!W$41,\"\")","v":""},{"$f":"IF(Inscripciones!X$3=GastosIngresos!$B6,Inscripciones!X$41,\"\")","v":""},{"$f":"IF(Inscripciones!Y$3=GastosIngresos!$B6,Inscripciones!Y$41,\"\")","v":""},{"$f":"IF(Inscripciones!Z$3=GastosIngresos!$B6,Inscripciones!Z$41,\"\")","v":""},{"$f":"IF(Inscripciones!AA$3=GastosIngresos!$B6,Inscripciones!AA$41,\"\")","v":""},{"$f":"IF(Inscripciones!AB$3=GastosIngresos!$B6,Inscripciones!AB$41,\"\")","v":""},{"$f":"IF(Inscripciones!AC$3=GastosIngresos!$B6,Inscripciones!AC$41,\"\")","v":""},{"$f":"IF(Inscripciones!AD$3=GastosIngresos!$B6,Inscripciones!AD$41,\"\")","v":""},{"$f":"IF(Inscripciones!AE$3=GastosIngresos!$B6,Inscripciones!AE$41,\"\")","v":0},{"$f":"IF(Inscripciones!AF$3=GastosIngresos!$B6,Inscripciones!AF$41,\"\")","v":0},{"$f":"IF(Inscripciones!AG$3=GastosIngresos!$B6,Inscripciones!AG$41,\"\")","v":0},{"$f":"IF(Inscripciones!AH$3=GastosIngresos!$B6,Inscripciones!AH$41,\"\")","v":0},{"$f":"IF(Inscripciones!AI$3=GastosIngresos!$B6,Inscripciones!AI$41,\"\")","v":0},{"$f":"IF(Inscripciones!AJ$3=GastosIngresos!$B6,Inscripciones!AJ$41,\"\")","v":0},{"$f":"IF(Inscripciones!AK$3=GastosIngresos!$B6,Inscripciones!AK$41,\"\")","v":0},{"$f":"IF(Inscripciones!AL$3=GastosIngresos!$B6,Inscripciones!AL$41,\"\")","v":0},{"$f":"IF(Inscripciones!AM$3=GastosIngresos!$B6,Inscripciones!AM$41,\"\")","v":0},{"$f":"IF(Inscripciones!AN$3=GastosIngresos!$B6,Inscripciones!AN$41,\"\")","v":0},{"$f":"IF(Inscripciones!AO$3=GastosIngresos!$B6,Inscripciones!AO$41,\"\")","v":0},{"$f":"IF(Inscripciones!AP$3=GastosIngresos!$B6,Inscripciones!AP$41,\"\")","v":0},{"$f":"IF(Inscripciones!AQ$3=GastosIngresos!$B6,Inscripciones!AQ$41,\"\")","v":0},{"$f":"IF(Inscripciones!AR$3=GastosIngresos!$B6,Inscripciones!AR$41,\"\")","v":0},{"$f":"IF(Inscripciones!AS$3=GastosIngresos!$B6,Inscripciones!AS$41,\"\")","v":0},{"$f":"IF(Inscripciones!AT$3=GastosIngresos!$B6,Inscripciones!AT$41,\"\")","v":0},{"$f":"IF(Inscripciones!AU$3=GastosIngresos!$B6,Inscripciones!AU$41,\"\")","v":""},{"$f":"IF(Inscripciones!AV$3=GastosIngresos!$B6,Inscripciones!AV$41,\"\")","v":""},{"$f":"IF(Inscripciones!AW$3=GastosIngresos!$B6,Inscripciones!AW$41,\"\")","v":""},{"$f":"IF(Inscripciones!AX$3=GastosIngresos!$B6,Inscripciones!AX$41,\"\")","v":""},{"$f":"IF(Inscripciones!AY$3=GastosIngresos!$B6,Inscripciones!AY$41,\"\")","v":""},{"$f":"IF(Inscripciones!AZ$3=GastosIngresos!$B6,Inscripciones!AZ$41,\"\")","v":""},{"$f":"IF(Inscripciones!BA$3=GastosIngresos!$B6,Inscripciones!BA$41,\"\")","v":""},{"$f":"IF(Inscripciones!BB$3=GastosIngresos!$B6,Inscripciones!BB$41,\"\")","v":""},{"$f":"IF(Inscripciones!BC$3=GastosIngresos!$B6,Inscripciones!BC$41,\"\")","v":""},{"$f":"IF(Inscripciones!BD$3=GastosIngresos!$B6,Inscripciones!BD$41,\"\")","v":""},0]
["Junio","J",{"$f":"IF(Inscripciones!C$3=GastosIngresos!$B7,Inscripciones!C$41,\"\")","v":""},{"$f":"IF(Inscripciones!D$3=GastosIngresos!$B7,Inscripciones!D$41,\"\")","v":""},{"$f":"IF(Inscripciones!E$3=GastosIngresos!$B7,Inscripciones!E$41,\"\")","v":""},{"$f":"IF(Inscripciones!F$3=GastosIngresos!$B7,Inscripciones!F$41,\"\")","v":""},{"$f":"IF(Inscripciones!G$3=GastosIngresos!$B7,Inscripciones!G$41,\"\")","v":""},{"$f":"IF(Inscripciones!H$3=GastosIngresos!$B7,Inscripciones!H$41,\"\")","v":""},{"$f":"IF(Inscripciones!I$3=GastosIngresos!$B7,Inscripciones!I$41,\"\")","v":""},{"$f":"IF(Inscripciones!J$3=GastosIngresos!$B7,Inscripciones!J$41,\"\")","v":""},{"$f":"IF(Inscripciones!K$3=GastosIngresos!$B7,Inscripciones!K$41,\"\")","v":""},{"$f":"IF(Inscripciones!L$3=GastosIngresos!$B7,Inscripciones!L$41,\"\")","v":""},{"$f":"IF(Inscripciones!M$3=GastosIngresos!$B7,Inscripciones!M$41,\"\")","v":""},{"$f":"IF(Inscripciones!N$3=GastosIngresos!$B7,Inscripciones!N$41,\"\")","v":""},{"$f":"IF(Inscripciones!O$3=GastosIngresos!$B7,Inscripciones!O$41,\"\")","v":""},{"$f":"IF(Inscripciones!P$3=GastosIngresos!$B7,Inscripciones!P$41,\"\")","v":""},{"$f":"IF(Inscripciones!Q$3=GastosIngresos!$B7,Inscripciones!Q$41,\"\")","v":""},{"$f":"IF(Inscripciones!R$3=GastosIngresos!$B7,Inscripciones!R$41,\"\")","v":""},{"$f":"IF(Inscripciones!S$3=GastosIngresos!$B7,Inscripciones!S$41,\"\")","v":""},{"$f":"IF(Inscripciones!T$3=GastosIngresos!$B7,Inscripciones!T$41,\"\")","v":""},{"$f":"IF(Inscripciones!U$3=GastosIngresos!$B7,Inscripciones!U$41,\"\")","v":""},{"$f":"IF(Inscripciones!V$3=GastosIngresos!$B7,Inscripciones!V$41,\"\")","v":""},{"$f":"IF(Inscripciones!W$3=GastosIngresos!$B7,Inscripciones!W$41,\"\")","v":""},{"$f":"IF(Inscripciones!X$3=GastosIngresos!$B7,Inscripciones!X$41,\"\")","v":""},{"$f":"IF(Inscripciones!Y$3=GastosIngresos!$B7,Inscripciones!Y$41,\"\")","v":""},{"$f":"IF(Inscripciones!Z$3=GastosIngresos!$B7,Inscripciones!Z$41,\"\")","v":""},{"$f":"IF(Inscripciones!AA$3=GastosIngresos!$B7,Inscripciones!AA$41,\"\")","v":""},{"$f":"IF(Inscripciones!AB$3=GastosIngresos!$B7,Inscripciones!AB$41,\"\")","v":""},{"$f":"IF(Inscripciones!AC$3=GastosIngresos!$B7,Inscripciones!AC$41,\"\")","v":""},{"$f":"IF(Inscripciones!AD$3=GastosIngresos!$B7,Inscripciones!AD$41,\"\")","v":""},{"$f":"IF(Inscripciones!AE$3=GastosIngresos!$B7,Inscripciones!AE$41,\"\")","v":""},{"$f":"IF(Inscripciones!AF$3=GastosIngresos!$B7,Inscripciones!AF$41,\"\")","v":""},{"$f":"IF(Inscripciones!AG$3=GastosIngresos!$B7,Inscripciones!AG$41,\"\")","v":""},{"$f":"IF(Inscripciones!AH$3=GastosIngresos!$B7,Inscripciones!AH$41,\"\")","v":""},{"$f":"IF(Inscripciones!AI$3=GastosIngresos!$B7,Inscripciones!AI$41,\"\")","v":""},{"$f":"IF(Inscripciones!AJ$3=GastosIngresos!$B7,Inscripciones!AJ$41,\"\")","v":""},{"$f":"IF(Inscripciones!AK$3=GastosIngresos!$B7,Inscripciones!AK$41,\"\")","v":""},{"$f":"IF(Inscripciones!AL$3=GastosIngresos!$B7,Inscripciones!AL$41,\"\")","v":""},{"$f":"IF(Inscripciones!AM$3=GastosIngresos!$B7,Inscripciones!AM$41,\"\")","v":""},{"$f":"IF(Inscripciones!AN$3=GastosIngresos!$B7,Inscripciones!AN$41,\"\")","v":""},{"$f":"IF(Inscripciones!AO$3=GastosIngresos!$B7,Inscripciones!AO$41,\"\")","v":""},{"$f":"IF(Inscripciones!AP$3=GastosIngresos!$B7,Inscripciones!AP$41,\"\")","v":""},{"$f":"IF(Inscripciones!AQ$3=GastosIngresos!$B7,Inscripciones!AQ$41,\"\")","v":""},{"$f":"IF(Inscripciones!AR$3=GastosIngresos!$B7,Inscripciones!AR$41,\"\")","v":""},{"$f":"IF(Inscripciones!AS$3=GastosIngresos!$B7,Inscripciones!AS$41,\"\")","v":""},{"$f":"IF(Inscripciones!AT$3=GastosIngresos!$B7,Inscripciones!AT$41,\"\")","v":""},{"$f":"IF(Inscripciones!AU$3=GastosIngresos!$B7,Inscripciones!AU$41,\"\")","v":0},{"$f":"IF(Inscripciones!AV$3=GastosIngresos!$B7,Inscripciones!AV$41,\"\")","v":0},{"$f":"IF(Inscripciones!AW$3=GastosIngresos!$B7,Inscripciones!AW$41,\"\")","v":0},{"$f":"IF(Inscripciones!AX$3=GastosIngresos!$B7,Inscripciones!AX$41,\"\")","v":0},{"$f":"IF(Inscripciones!AY$3=GastosIngresos!$B7,Inscripciones!AY$41,\"\")","v":0},{"$f":"IF(Inscripciones!AZ$3=GastosIngresos!$B7,Inscripciones!AZ$41,\"\")","v":0},{"$f":"IF(Inscripciones!BA$3=GastosIngresos!$B7,Inscripciones!BA$41,\"\")","v":0},{"$f":"IF(Inscripciones!BB$3=GastosIngresos!$B7,Inscripciones!BB$41,\"\")","v":0},{"$f":"IF(Inscripciones!BC$3=GastosIngresos!$B7,Inscripciones!BC$41,\"\")","v":0},{"$f":"IF(Inscripciones!BD$3=GastosIngresos!$B7,Inscripciones!BD$41,\"\")","v":""},0]
["Julio","Jl",{"$f":"IF(Inscripciones!C$3=GastosIngresos!$B8,Inscripciones!C$41,\"\")","v":""},{"$f":"IF(Inscripciones!D$3=GastosIngresos!$B8,Inscripciones!D$41,\"\")","v":""},{"$f":"IF(Inscripciones!E$3=GastosIngresos!$B8,Inscripciones!E$41,\"\")","v":""},{"$f":"IF(Inscripciones!F$3=GastosIngresos!$B8,Inscripciones!F$41,\"\")","v":""},{"$f":"IF(Inscripciones!G$3=GastosIngresos!$B8,Inscripciones!G$41,\"\")","v":""},{"$f":"IF(Inscripciones!H$3=GastosIngresos!$B8,Inscripciones!H$41,\"\")","v":""},{"$f":"IF(Inscripciones!I$3=GastosIngresos!$B8,Inscripciones!I$41,\"\")","v":""},{"$f":"IF(Inscripciones!J$3=GastosIngresos!$B8,Inscripciones!J$41,\"\")","v":""},{"$f":"IF(Inscripciones!K$3=GastosIngresos!$B8,Inscripciones!K$41,\"\")","v":""},{"$f":"IF(Inscripciones!L$3=GastosIngresos!$B8,Inscripciones!L$41,\"\")","v":""},{"$f":"IF(Inscripciones!M$3=GastosIngresos!$B8,Inscripciones!M$41,\"\")","v":""},{"$f":"IF(Inscripciones!N$3=GastosIngresos!$B8,Inscripciones!N$41,\"\")","v":""},{"$f":"IF(Inscripciones!O$3=GastosIngresos!$B8,Inscripciones!O$41,\"\")","v":""},{"$f":"IF(Inscripciones!P$3=GastosIngresos!$B8,Inscripciones!P$41,\"\")","v":""},{"$f":"IF(Inscripciones!Q$3=GastosIngresos!$B8,Inscripciones!Q$41,\"\")","v":""},{"$f":"IF(Inscripciones!R$3=GastosIngresos!$B8,Inscripciones!R$41,\"\")","v":""},{"$f":"IF(Inscripciones!S$3=GastosIngresos!$B8,Inscripciones!S$41,\"\")","v":""},{"$f":"IF(Inscripciones!T$3=GastosIngresos!$B8,Inscripciones!T$41,\"\")","v":""},{"$f":"IF(Inscripciones!U$3=GastosIngresos!$B8,Inscripciones!U$41,\"\")","v":""},{"$f":"IF(Inscripciones!V$3=GastosIngresos!$B8,Inscripciones!V$41,\"\")","v":""},{"$f":"IF(Inscripciones!W$3=GastosIngresos!$B8,Inscripciones!W$41,\"\")","v":""},{"$f":"IF(Inscripciones!X$3=GastosIngresos!$B8,Inscripciones!X$41,\"\")","v":""},{"$f":"IF(Inscripciones!Y$3=GastosIngresos!$B8,Inscripciones!Y$41,\"\")","v":""},{"$f":"IF(Inscripciones!Z$3=GastosIngresos!$B8,Inscripciones!Z$41,\"\")","v":""},{"$f":"IF(Inscripciones!AA$3=GastosIngresos!$B8,Inscripciones!AA$41,\"\")","v":""},{"$f":"IF(Inscripciones!AB$3=GastosIngresos!$B8,Inscripciones!AB$41,\"\")","v":""},{"$f":"IF(Inscripciones!AC$3=GastosIngresos!$B8,Inscripciones!AC$41,\"\")","v":""},{"$f":"IF(Inscripciones!AD$3=GastosIngresos!$B8,Inscripciones!AD$41,\"\")","v":""},{"$f":"IF(Inscripciones!AE$3=GastosIngresos!$B8,Inscripciones!AE$41,\"\")","v":""},{"$f":"IF(Inscripciones!AF$3=GastosIngresos!$B8,Inscripciones!AF$41,\"\")","v":""},{"$f":"IF(Inscripciones!AG$3=GastosIngresos!$B8,Inscripciones!AG$41,\"\")","v":""},{"$f":"IF(Inscripciones!AH$3=GastosIngresos!$B8,Inscripciones!AH$41,\"\")","v":""},{"$f":"IF(Inscripciones!AI$3=GastosIngresos!$B8,Inscripciones!AI$41,\"\")","v":""},{"$f":"IF(Inscripciones!AJ$3=GastosIngresos!$B8,Inscripciones!AJ$41,\"\")","v":""},{"$f":"IF(Inscripciones!AK$3=GastosIngresos!$B8,Inscripciones!AK$41,\"\")","v":""},{"$f":"IF(Inscripciones!AL$3=GastosIngresos!$B8,Inscripciones!AL$41,\"\")","v":""},{"$f":"IF(Inscripciones!AM$3=GastosIngresos!$B8,Inscripciones!AM$41,\"\")","v":""},{"$f":"IF(Inscripciones!AN$3=GastosIngresos!$B8,Inscripciones!AN$41,\"\")","v":""},{"$f":"IF(Inscripciones!AO$3=GastosIngresos!$B8,Inscripciones!AO$41,\"\")","v":""},{"$f":"IF(Inscripciones!AP$3=GastosIngresos!$B8,Inscripciones!AP$41,\"\")","v":""},{"$f":"IF(Inscripciones!AQ$3=GastosIngresos!$B8,Inscripciones!AQ$41,\"\")","v":""},{"$f":"IF(Inscripciones!AR$3=GastosIngresos!$B8,Inscripciones!AR$41,\"\")","v":""},{"$f":"IF(Inscripciones!AS$3=GastosIngresos!$B8,Inscripciones!AS$41,\"\")","v":""},{"$f":"IF(Inscripciones!AT$3=GastosIngresos!$B8,Inscripciones!AT$41,\"\")","v":""},{"$f":"IF(Inscripciones!AU$3=GastosIngresos!$B8,Inscripciones!AU$41,\"\")","v":""},{"$f":"IF(Inscripciones!AV$3=GastosIngresos!$B8,Inscripciones!AV$41,\"\")","v":""},{"$f":"IF(Inscripciones!AW$3=GastosIngresos!$B8,Inscripciones!AW$41,\"\")","v":""},{"$f":"IF(Inscripciones!AX$3=GastosIngresos!$B8,Inscripciones!AX$41,\"\")","v":""},{"$f":"IF(Inscripciones!AY$3=GastosIngresos!$B8,Inscripciones!AY$41,\"\")","v":""},{"$f":"IF(Inscripciones!AZ$3=GastosIngresos!$B8,Inscripciones!AZ$41,\"\")","v":""},{"$f":"IF(Inscripciones!BA$3=GastosIngresos!$B8,Inscripciones!BA$41,\"\")","v":""},{"$f":"IF(Inscripciones!BB$3=GastosIngresos!$B8,Inscripciones!BB$41,\"\")","v":""},{"$f":"IF(Inscripciones!BC$3=GastosIngresos!$B8,Inscripciones!BC$41,\"\")","v":""},{"$f":"IF(Inscripciones!BD$3=GastosIngresos!$B8,Inscripciones!BD$41,\"\")","v":""},0]
["Agosto","Ag",{"$f":"IF(Inscripciones!C$3=GastosIngresos!$B9,Inscripciones!C$41,\"\")","v":0},{"$f":"IF(Inscripciones!D$3=GastosIngresos!$B9,Inscripciones!D$41,\"\")","v":0},{"$f":"IF(Inscripciones!E$3=GastosIngresos!$B9,Inscripciones!E$41,\"\")","v":0},{"$f":"IF(Inscripciones!F$3=GastosIngresos!$B9,Inscripciones!F$41,\"\")","v":0},{"$f":"IF(Inscripciones!G$3=GastosIngresos!$B9,Inscripciones!G$41,\"\")","v":0},{"$f":"IF(Inscripciones!H$3=GastosIngresos!$B9,Inscripciones!H$41,\"\")","v":0},{"$f":"IF(Inscripciones!I$3=GastosIngresos!$B9,Inscripciones!I$41,\"\")","v":0},{"$f":"IF(Inscripciones!J$3=GastosIngresos!$B9,Inscripciones!J$41,\"\")","v":0},{"$f":"IF(Inscripciones!K$3=GastosIngresos!$B9,Inscripciones!K$41,\"\")","v":0},{"$f":"IF(Inscripciones!L$3=GastosIngresos!$B9,Inscripciones!L$41,\"\")","v":0},{"$f":"IF(Inscripciones!M$3=GastosIngresos!$B9,Inscripciones!M$41,\"\")","v":""},{"$f":"IF(Inscripciones!N$3=GastosIngresos!$B9,Inscripciones!N$41,\"\")","v":""},{"$f":"IF(Inscripciones!O$3=GastosIngresos!$B9,Inscripciones!O$41,\"\")","v":""},{"$f":"IF(Inscripciones!P$3=GastosIngresos!$B9,Inscripciones!P$41,\"\")","v":""},{"$f":"IF(Inscripciones!Q$3=GastosIngresos!$B9,Inscripciones!Q$41,\"\")","v":""},{"$f":"IF(Inscripciones!R$3=GastosIngresos!$B9,Inscripciones!R$41,\"\")","v":""},{"$f":"IF(Inscripciones!S$3=GastosIngresos!$B9,Inscripciones!S$41,\"\")","v":""},{"$f":"IF(Inscripciones!T$3=GastosIngresos!$B9,Inscripciones!T$41,\"\")","v":""},{"$f":"IF(Inscripciones!U$3=GastosIngresos!$B9,Inscripciones!U$41,\"\")","v":""},{"$f":"IF(Inscripciones!V$3=GastosIngresos!$B9,Inscripciones!V$41,\"\")","v":""},{"$f":"IF(Inscripciones!W$3=GastosIngresos!$B9,Inscripciones!W$41,\"\")","v":""},{"$f":"IF(Inscripciones!X$3=GastosIngresos!$B9,Inscripciones!X$41,\"\")","v":""},{"$f":"IF(Inscripciones!Y$3=GastosIngresos!$B9,Inscripciones!Y$41,\"\")","v":""},{"$f":"IF(Inscripciones!Z$3=GastosIngresos!$B9,Inscripciones!Z$41,\"\")","v":""},{"$f":"IF(Inscripciones!AA$3=GastosIngresos!$B9,Inscripciones!AA$41,\"\")","v":""},{"$f":"IF(Inscripciones!AB$3=GastosIngresos!$B9,Inscripciones!AB$41,\"\")","v":""},{"$f":"IF(Inscripciones!AC$3=GastosIngresos!$B9,Inscripciones!AC$41,\"\")","v":""},{"$f":"IF(Inscripciones!AD$3=GastosIngresos!$B9,Inscripciones!AD$41,\"\")","v":""},{"$f":"IF(Inscripciones!AE$3=GastosIngresos!$B9,Inscripciones!AE$41,\"\")","v":""},{"$f":"IF(Inscripciones!AF$3=GastosIngresos!$B9,Inscripciones!AF$41,\"\")","v":""},{"$f":"IF(Inscripciones!AG$3=GastosIngresos!$B9,Inscripciones!AG$41,\"\")","v":""},{"$f":"IF(Inscripciones!AH$3=GastosIngresos!$B9,Inscripciones!AH$41,\"\")","v":""},{"$f":"IF(Inscripciones!AI$3=GastosIngresos!$B9,Inscripciones!AI$41,\"\")","v":""},{"$f":"IF(Inscripciones!AJ$3=GastosIngresos!$B9,Inscripciones!AJ$41,\"\")","v":""},{"$f":"IF(Inscripciones!AK$3=GastosIngresos!$B9,Inscripciones!AK$41,\"\")","v":""},{"$f":"IF(Inscripciones!AL$3=GastosIngresos!$B9,Inscripciones!AL$41,\"\")","v":""},{"$f":"IF(Inscripciones!AM$3=GastosIngresos!$B9,Inscripciones!AM$41,\"\")","v":""},{"$f":"IF(Inscripciones!AN$3=GastosIngresos!$B9,Inscripciones!AN$41,\"\")","v":""},{"$f":"IF(Inscripciones!AO$3=GastosIngresos!$B9,Inscripciones!AO$41,\"\")","v":""},{"$f":"IF(Inscripciones!AP$3=GastosIngresos!$B9,Inscripciones!AP$41,\"\")","v":""},{"$f":"IF(Inscripciones!AQ$3=GastosIngresos!$B9,Inscripciones!AQ$41,\"\")","v":""},{"$f":"IF(Inscripciones!AR$3=GastosIngresos!$B9,Inscripciones!AR$41,\"\")","v":""},{"$f":"IF(Inscripciones!AS$3=GastosIngresos!$B9,Inscripciones!AS$41,\"\")","v":""},{"$f":"IF(Inscripciones!AT$3=GastosIngresos!$B9,Inscripciones!AT$41,\"\")","v":""},{"$f":"IF(Inscripciones!AU$3=GastosIngresos!$B9,Inscripciones!AU$41,\"\")","v":""},{"$f":"IF(Inscripciones!AV$3=GastosIngresos!$B9,Inscripciones!AV$41,\"\")","v":""},{"$f":"IF(Inscripciones!AW$3=GastosIngresos!$B9,Inscripciones!AW$41,\"\")","v":""},{"$f":"IF(Inscripciones!AX$3=GastosIngresos!$B9,Inscripciones!AX$41,\"\")","v":""},{"$f":"IF(Inscripciones!AY$3=GastosIngresos!$B9,Inscripciones!AY$41,\"\")","v":""},{"$f":"IF(Inscripciones!AZ$3=GastosIngresos!$B9,Inscripciones!AZ$41,\"\")","v":""},{"$f":"IF(Inscripciones!BA$3=GastosIngresos!$B9,Inscripciones!BA$41,\"\")","v":""},{"$f":"IF(Inscripciones!BB$3=GastosIngresos!$B9,Inscripciones!BB$41,\"\")","v":""},{"$f":"IF(Inscripciones!BC$3=GastosIngresos!$B9,Inscripciones!BC$41,\"\")","v":""},{"$f":"IF(Inscripciones!BD$3=GastosIngresos!$B9,Inscripciones!BD$41,\"\")","v":""},0]
["Septiembre","S",{"$f":"IF(Inscripciones!C$3=GastosIngresos!$B10,Inscripciones!C$41,\"\")","v":""},{"$f":"IF(Inscripciones!D$3=GastosIngresos!$B10,Inscripciones!D$41,\"\")","v":""},{"$f":"IF(Inscripciones!E$3=GastosIngresos!$B10,Inscripciones!E$41,\"\")","v":""},{"$f":"IF(Inscripciones!F$3=GastosIngresos!$B10,Inscripciones!F$41,\"\")","v":""},{"$f":"IF(Inscripciones!G$3=GastosIngresos!$B10,Inscripciones!G$41,\"\")","v":""},{"$f":"IF(Inscripciones!H$3=GastosIngresos!$B10,Inscripciones!H$41,\"\")","v":""},{"$f":"IF(Inscripciones!I$3=GastosIngresos!$B10,Inscripciones!I$41,\"\")","v":""},{"$f":"IF(Inscripciones!J$3=GastosIngresos!$B10,Inscripciones!J$41,\"\")","v":""},{"$f":"IF(Inscripciones!K$3=GastosIngresos!$B10,Inscripciones!K$41,\"\")","v":""},{"$f":"IF(Inscripciones!L$3=GastosIngresos!$B10,Inscripciones!L$41,\"\")","v":""},{"$f":"IF(Inscripciones!M$3=GastosIngresos!$B10,Inscripciones!M$41,\"\")","v":0},{"$f":"IF(Inscripciones!N$3=GastosIngresos!$B10,Inscripciones!N$41,\"\")","v":0},{"$f":"IF(Inscripciones!O$3=GastosIngresos!$B10,Inscripciones!O$41,\"\")","v":0},{"$f":"IF(Inscripciones!P$3=GastosIngresos!$B10,Inscripciones!P$41,\"\")","v":0},{"$f":"IF(Inscripciones!Q$3=GastosIngresos!$B10,Inscripciones!Q$41,\"\")","v":0},{"$f":"IF(Inscripciones!R$3=GastosIngresos!$B10,Inscripciones!R$41,\"\")","v":""},{"$f":"IF(Inscripciones!S$3=GastosIngresos!$B10,Inscripciones!S$41,\"\")","v":""},{"$f":"IF(Inscripciones!T$3=GastosIngresos!$B10,Inscripciones!T$41,\"\")","v":""},{"$f":"IF(Inscripciones!U$3=GastosIngresos!$B10,Inscripciones!U$41,\"\")","v":""},{"$f":"IF(Inscripciones!V$3=GastosIngresos!$B10,Inscripciones!V$41,\"\")","v":""},{"$f":"IF(Inscripciones!W$3=GastosIngresos!$B10,Inscripciones!W$41,\"\")","v":""},{"$f":"IF(Inscripciones!X$3=GastosIngresos!$B10,Inscripciones!X$41,\"\")","v":""},{"$f":"IF(Inscripciones!Y$3=GastosIngresos!$B10,Inscripciones!Y$41,\"\")","v":""},{"$f":"IF(Inscripciones!Z$3=GastosIngresos!$B10,Inscripciones!Z$41,\"\")","v":""},{"$f":"IF(Inscripciones!AA$3=GastosIngresos!$B10,Inscripciones!AA$41,\"\")","v":""},{"$f":"IF(Inscripciones!AB$3=GastosIngresos!$B10,Inscripciones!AB$41,\"\")","v":""},{"$f":"IF(Inscripciones!AC$3=GastosIngresos!$B10,Inscripciones!AC$41,\"\")","v":""},{"$f":"IF(Inscripciones!AD$3=GastosIngresos!$B10,Inscripciones!AD$41,\"\")","v":""},{"$f":"IF(Inscripciones!AE$3=GastosIngresos!$B10,Inscripciones!AE$41,\"\")","v":""},{"$f":"IF(Inscripciones!AF$3=GastosIngresos!$B10,Inscripciones!AF$41,\"\")","v":""},{"$f":"IF(Inscripciones!AG$3=GastosIngresos!$B10,Inscripciones!AG$41,\"\")","v":""},{"$f":"IF(Inscripciones!AH$3=GastosIngresos!$B10,Inscripciones!AH$41,\"\")","v":""},{"$f":"IF(Inscripciones!AI$3=GastosIngresos!$B10,Inscripciones!AI$41,\"\")","v":""},{"$f":"IF(Inscripciones!AJ$3=GastosIngresos!$B10,Inscripciones!AJ$41,\"\")","v":""},{"$f":"IF(Inscripciones!AK$3=GastosIngresos!$B10,Inscripciones!AK$41,\"\")","v":""},{"$f":"IF(Inscripciones!AL$3=GastosIngresos!$B10,Inscripciones!AL$41,\"\")","v":""},{"$f":"IF(Inscripciones!AM$3=GastosIngresos!$B10,Inscripciones!AM$41,\"\")","v":""},{"$f":"IF(Inscripciones!AN$3=GastosIngresos!$B10,Inscripciones!AN$41,\"\")","v":""},{"$f":"IF(Inscripciones!AO$3=GastosIngresos!$B10,Inscripciones!AO$41,\"\")","v":""},{"$f":"IF(Inscripciones!AP$3=GastosIngresos!$B10,Inscripciones!AP$41,\"\")","v":""},{"$f":"IF(Inscripciones!AQ$3=GastosIngresos!$B10,Inscripciones!AQ$41,\"\")","v":""},{"$f":"IF(Inscripciones!AR$3=GastosIngresos!$B10,Inscripciones!AR$41,\"\")","v":""},{"$f":"IF(Inscripciones!AS$3=GastosIngresos!$B10,Inscripciones!AS$41,\"\")","v":""},{"$f":"IF(Inscripciones!AT$3=GastosIngresos!$B10,Inscripciones!AT$41,\"\")","v":""},{"$f":"IF(Inscripciones!AU$3=GastosIngresos!$B10,Inscripciones!AU$41,\"\")","v":""},{"$f":"IF(Inscripciones!AV$3=GastosIngresos!$B10,Inscripciones!AV$41,\"\")","v":""},{"$f":"IF(Inscripciones!AW$3=GastosIngresos!$B10,Inscripciones!AW$41,\"\")","v":""},{"$f":"IF(Inscripciones!AX$3=GastosIngresos!$B10,Inscripciones!AX$41,\"\")","v":""},{"$f":"IF(Inscripciones!AY$3=GastosIngresos!$B10,Inscripciones!AY$41,\"\")","v":""},{"$f":"IF(Inscripciones!AZ$3=GastosIngresos!$B10,Inscripciones!AZ$41,\"\")","v":""},{"$f":"IF(Inscripciones!BA$3=GastosIngresos!$B10,Inscripciones!BA$41,\"\")","v":""},{"$f":"IF(Inscripciones!BB$3=GastosIngresos!$B10,Inscripciones!BB$41,\"\")","v":""},{"$f":"IF(Inscripciones!BC$3=GastosIngresos!$B10,Inscripciones!BC$41,\"\")","v":""},{"$f":"IF(Inscripciones!BD$3=GastosIngresos!$B10,Inscripciones!BD$41,\"\")","v":""},0]
["Octubre","O",{"$f":"IF(Inscripciones!C$3=GastosIngresos!$B11,Inscripciones!C$41,\"\")","v":""},{"$f":"IF(Inscripciones!D$3=GastosIngresos!$B11,Inscripciones!D$41,\"\")","v":""},{"$f":"IF(Inscripciones!E$3=GastosIngresos!$B11,Inscripciones!E$41,\"\")","v":""},{"$f":"IF(Inscripciones!F$3=GastosIngresos!$B11,Inscripciones!F$41,\"\")","v":""},{"$f":"IF(Inscripciones!G$3=GastosIngresos!$B11,Inscripciones!G$41,\"\")","v":""},{"$f":"IF(Inscripciones!H$3=GastosIngresos!$B11,Inscripciones!H$41,\"\")","v":""},{"$f":"IF(Inscripciones!I$3=GastosIngresos!$B11,Inscripciones!I$41,\"\")","v":""},{"$f":"IF(Inscripciones!J$3=GastosIngresos!$B11,Inscripciones!J$41,\"\")","v":""},{"$f":"IF(Inscripciones!K$3=GastosIngresos!$B11,Inscripciones!K$41,\"\")","v":""},{"$f":"IF(Inscripciones!L$3=GastosIngresos!$B11,Inscripciones!L$41,\"\")","v":""},{"$f":"IF(Inscripciones!M$3=GastosIngresos!$B11,Inscripciones!M$41,\"\")","v":""},{"$f":"IF(Inscripciones!N$3=GastosIngresos!$B11,Inscripciones!N$41,\"\")","v":""},{"$f":"IF(Inscripciones!O$3=GastosIngresos!$B11,Inscripciones!O$41,\"\")","v":""},{"$f":"IF(Inscripciones!P$3=GastosIngresos!$B11,Inscripciones!P$41,\"\")","v":""},{"$f":"IF(Inscripciones!Q$3=GastosIngresos!$B11,Inscripciones!Q$41,\"\")","v":""},{"$f":"IF(Inscripciones!R$3=GastosIngresos!$B11,Inscripciones!R$41,\"\")","v":0},{"$f":"IF(Inscripciones!S$3=GastosIngresos!$B11,Inscripciones!S$41,\"\")","v":0},{"$f":"IF(Inscripciones!T$3=GastosIngresos!$B11,Inscripciones!T$41,\"\")","v":0},{"$f":"IF(Inscripciones!U$3=GastosIngresos!$B11,Inscripciones!U$41,\"\")","v":0},{"$f":"IF(Inscripciones!V$3=GastosIngresos!$B11,Inscripciones!V$41,\"\")","v":0},{"$f":"IF(Inscripciones!W$3=GastosIngresos!$B11,Inscripciones!W$41,\"\")","v":0},{"$f":"IF(Inscripciones!X$3=GastosIngresos!$B11,Inscripciones!X$41,\"\")","v":0},{"$f":"IF(Inscripciones!Y$3=GastosIngresos!$B11,Inscripciones!Y$41,\"\")","v":0},{"$f":"IF(Inscripciones!Z$3=GastosIngresos!$B11,Inscripciones!Z$41,\"\")","v":""},{"$f":"IF(Inscripciones!AA$3=GastosIngresos!$B11,Inscripciones!AA$41,\"\")","v":""},{"$f":"IF(Inscripciones!AB$3=GastosIngresos!$B11,Inscripciones!AB$41,\"\")","v":""},{"$f":"IF(Inscripciones!AC$3=GastosIngresos!$B11,Inscripciones!AC$41,\"\")","v":""},{"$f":"IF(Inscripciones!AD$3=GastosIngresos!$B11,Inscripciones!AD$41,\"\")","v":""},{"$f":"IF(Inscripciones!AE$3=GastosIngresos!$B11,Inscripciones!AE$41,\"\")","v":""},{"$f":"IF(Inscripciones!AF$3=GastosIngresos!$B11,Inscripciones!AF$41,\"\")","v":""},{"$f":"IF(Inscripciones!AG$3=GastosIngresos!$B11,Inscripciones!AG$41,\"\")","v":""},{"$f":"IF(Inscripciones!AH$3=GastosIngresos!$B11,Inscripciones!AH$41,\"\")","v":""},{"$f":"IF(Inscripciones!AI$3=GastosIngresos!$B11,Inscripciones!AI$41,\"\")","v":""},{"$f":"IF(Inscripciones!AJ$3=GastosIngresos!$B11,Inscripciones!AJ$41,\"\")","v":""},{"$f":"IF(Inscripciones!AK$3=GastosIngresos!$B11,Inscripciones!AK$41,\"\")","v":""},{"$f":"IF(Inscripciones!AL$3=GastosIngresos!$B11,Inscripciones!AL$41,\"\")","v":""},{"$f":"IF(Inscripciones!AM$3=GastosIngresos!$B11,Inscripciones!AM$41,\"\")","v":""},{"$f":"IF(Inscripciones!AN$3=GastosIngresos!$B11,Inscripciones!AN$41,\"\")","v":""},{"$f":"IF(Inscripciones!AO$3=GastosIngresos!$B11,Inscripciones!AO$41,\"\")","v":""},{"$f":"IF(Inscripciones!AP$3=GastosIngresos!$B11,Inscripciones!AP$41,\"\")","v":""},{"$f":"IF(Inscripciones!AQ$3=GastosIngresos!$B11,Inscripciones!AQ$41,\"\")","v":""},{"$f":"IF(Inscripciones!AR$3=GastosIngresos!$B11,Inscripciones!AR$41,\"\")","v":""},{"$f":"IF(Inscripciones!AS$3=GastosIngresos!$B11,Inscripciones!AS$41,\"\")","v":""},{"$f":"IF(Inscripciones!AT$3=GastosIngresos!$B11,Inscripciones!AT$41,\"\")","v":""},{"$f":"IF(Inscripciones!AU$3=GastosIngresos!$B11,Inscripciones!AU$41,\"\")","v":""},{"$f":"IF(Inscripciones!AV$3=GastosIngresos!$B11,Inscripciones!AV$41,\"\")","v":""},{"$f":"IF(Inscripciones!AW$3=GastosIngresos!$B11,Inscripciones!AW$41,\"\")","v":""},{"$f":"IF(Inscripciones!AX$3=GastosIngresos!$B11,Inscripciones!AX$41,\"\")","v":""},{"$f":"IF(Inscripciones!AY$3=GastosIngresos!$B11,Inscripciones!AY$41,\"\")","v":""},{"$f":"IF(Inscripciones!AZ$3=GastosIngresos!$B11,Inscripciones!AZ$41,\"\")","v":""},{"$f":"IF(Inscripciones!BA$3=GastosIngresos!$B11,Inscripciones!BA$41,\"\")","v":""},{"$f":"IF(Inscripciones!BB$3=GastosIngresos!$B11,Inscripciones!BB$41,\"\")","v":""},{"$f":"IF(Inscripciones!BC$3=GastosIngresos!$B11,Inscripciones!BC$41,\"\")","v":""},{"$f":"IF(Inscripciones!BD$3=GastosIngresos!$B11,Inscripciones!BD$41,\"\")","v":""},0]
["Noviembre","N",{"$f":"IF(Inscripciones!C$3=GastosIngresos!$B12,Inscripciones!C$41,\"\")","v":""},{"$f":"IF(Inscripciones!D$3=GastosIngresos!$B12,Inscripciones!D$41,\"\")","v":""},{"$f":"IF(Inscripciones!E$3=GastosIngresos!$B12,Inscripciones!E$41,\"\")","v":""},{"$f":"IF(Inscripciones!F$3=GastosIngresos!$B12,Inscripciones!F$41,\"\")","v":""},{"$f":"IF(Inscripciones!G$3=GastosIngresos!$B12,Inscripciones!G$41,\"\")","v":""},{"$f":"IF(Inscripciones!H$3=GastosIngresos!$B12,Inscripciones!H$41,\"\")","v":""},{"$f":"IF(Inscripciones!I$3=GastosIngresos!$B12,Inscripciones!I$41,\"\")","v":""},{"$f":"IF(Inscripciones!J$3=GastosIngresos!$B12,Inscripciones!J$41,\"\")","v":""},{"$f":"IF(Inscripciones!K$3=GastosIngresos!$B12,Inscripciones!K$41,\"\")","v":""},{"$f":"IF(Inscripciones!L$3=GastosIngresos!$B12,Inscripciones!L$41,\"\")","v":""},{"$f":"IF(Inscripciones!M$3=GastosIngresos!$B12,Inscripciones!M$41,\"\")","v":""},{"$f":"IF(Inscripciones!N$3=GastosIngresos!$B12,Inscripciones!N$41,\"\")","v":""},{"$f":"IF(Inscripciones!O$3=GastosIngresos!$B12,Inscripciones!O$41,\"\")","v":""},{"$f":"IF(Inscripciones!P$3=GastosIngresos!$B12,Inscripciones!P$41,\"\")","v":""},{"$f":"IF(Inscripciones!Q$3=GastosIngresos!$B12,Inscripciones!Q$41,\"\")","v":""},{"$f":"IF(Inscripciones!R$3=GastosIngresos!$B12,Inscripciones!R$41,\"\")","v":""},{"$f":"IF(Inscripciones!S$3=GastosIngresos!$B12,Inscripciones!S$41,\"\")","v":""},{"$f":"IF(Inscripciones!T$3=GastosIngresos!$B12,Inscripciones!T$41,\"\")","v":""},{"$f":"IF(Inscripciones!U$3=GastosIngresos!$B12,Inscripciones!U$41,\"\")","v":""},{"$f":"IF(Inscripciones!V$3=GastosIngresos!$B12,Inscripciones!V$41,\"\")","v":""},{"$f":"IF(Inscripciones!W$3=GastosIngresos!$B12,Inscripciones!W$41,\"\")","v":""},{"$f":"IF(Inscripciones!X$3=GastosIngresos!$B12,Inscripciones!X$41,\"\")","v":""},{"$f":"IF(Inscripciones!Y$3=GastosIngresos!$B12,Inscripciones!Y$41,\"\")","v":""},{"$f":"IF(Inscripciones!Z$3=GastosIngresos!$B12,Inscripciones!Z$41,\"\")","v":0},{"$f":"IF(Inscripciones!AA$3=GastosIngresos!$B12,Inscripciones!AA$41,\"\")","v":0},{"$f":"IF(Inscripciones!AB$3=GastosIngresos!$B12,Inscripciones!AB$41,\"\")","v":0},{"$f":"IF(Inscripciones!AC$3=GastosIngresos!$B12,Inscripciones!AC$41,\"\")","v":0},{"$f":"IF(Inscripciones!AD$3=GastosIngresos!$B12,Inscripciones!AD$41,\"\")","v":""},{"$f":"IF(Inscripciones!AE$3=GastosIngresos!$B12,Inscripciones!AE$41,\"\")","v":""},{"$f":"IF(Inscripciones!AF$3=GastosIngresos!$B12,Inscripciones!AF$41,\"\")","v":""},{"$f":"IF(Inscripciones!AG$3=GastosIngresos!$B12,Inscripciones!AG$41,\"\")","v":""},{"$f":"IF(Inscripciones!AH$3=GastosIngresos!$B12,Inscripciones!AH$41,\"\")","v":""},{"$f":"IF(Inscripciones!AI$3=GastosIngresos!$B12,Inscripciones!AI$41,\"\")","v":""},{"$f":"IF(Inscripciones!AJ$3=GastosIngresos!$B12,Inscripciones!AJ$41,\"\")","v":""},{"$f":"IF(Inscripciones!AK$3=GastosIngresos!$B12,Inscripciones!AK$41,\"\")","v":""},{"$f":"IF(Inscripciones!AL$3=GastosIngresos!$B12,Inscripciones!AL$41,\"\")","v":""},{"$f":"IF(Inscripciones!AM$3=GastosIngresos!$B12,Inscripciones!AM$41,\"\")","v":""},{"$f":"IF(Inscripciones!AN$3=GastosIngresos!$B12,Inscripciones!AN$41,\"\")","v":""},{"$f":"IF(Inscripciones!AO$3=GastosIngresos!$B12,Inscripciones!AO$41,\"\")","v":""},{"$f":"IF(Inscripciones!AP$3=GastosIngresos!$B12,Inscripciones!AP$41,\"\")","v":""},{"$f":"IF(Inscripciones!AQ$3=GastosIngresos!$B12,Inscripciones!AQ$41,\"\")","v":""},{"$f":"IF(Inscripciones!AR$3=GastosIngresos!$B12,Inscripciones!AR$41,\"\")","v":""},{"$f":"IF(Inscripciones!AS$3=GastosIngresos!$B12,Inscripciones!AS$41,\"\")","v":""},{"$f":"IF(Inscripciones!AT$3=GastosIngresos!$B12,Inscripciones!AT$41,\"\")","v":""},{"$f":"IF(Inscripciones!AU$3=GastosIngresos!$B12,Inscripciones!AU$41,\"\")","v":""},{"$f":"IF(Inscripciones!AV$3=GastosIngresos!$B12,Inscripciones!AV$41,\"\")","v":""},{"$f":"IF(Inscripciones!AW$3=GastosIngresos!$B12,Inscripciones!AW$41,\"\")","v":""},{"$f":"IF(Inscripciones!AX$3=GastosIngresos!$B12,Inscripciones!AX$41,\"\")","v":""},{"$f":"IF(Inscripciones!AY$3=GastosIngresos!$B12,Inscripciones!AY$41,\"\")","v":""},{"$f":"IF(Inscripciones!AZ$3=GastosIngresos!$B12,Inscripciones!AZ$41,\"\")","v":""},{"$f":"IF(Inscripciones!BA$3=GastosIngresos!$B12,Inscripciones!BA$41,\"\")","v":""},{"$f":"IF(Inscripciones!BB$3=GastosIngresos!$B12,Inscripciones!BB$41,\"\")","v":""},{"$f":"IF(Inscripciones!BC$3=GastosIngresos!$B12,Inscripciones!BC$41,\"\")","v":""},{"$f":"IF(Inscripciones!BD$3=GastosIngresos!$B12,Inscripciones!BD$41,\"\")","v":""},{"$f":"SUM(C12:BD12)","v":0}]
["Diciembre","D",{"$f":"IF(Inscripciones!C$3=GastosIngresos!$B13,Inscripciones!C$41,\"\")","v":""},{"$f":"IF(Inscripciones!D$3=GastosIngresos!$B13,Inscripciones!D$41,\"\")","v":""},{"$f":"IF(Inscripciones!E$3=GastosIngresos!$B13,Inscripciones!E$41,\"\")","v":""},{"$f":"IF(Inscripciones!F$3=GastosIngresos!$B13,Inscripciones!F$41,\"\")","v":""},{"$f":"IF(Inscripciones!G$3=GastosIngresos!$B13,Inscripciones!G$41,\"\")","v":""},{"$f":"IF(Inscripciones!H$3=GastosIngresos!$B13,Inscripciones!H$41,\"\")","v":""},{"$f":"IF(Inscripciones!I$3=GastosIngresos!$B13,Inscripciones!I$41,\"\")","v":""},{"$f":"IF(Inscripciones!J$3=GastosIngresos!$B13,Inscripciones!J$41,\"\")","v":""},{"$f":"IF(Inscripciones!K$3=GastosIngresos!$B13,Inscripciones!K$41,\"\")","v":""},{"$f":"IF(Inscripciones!L$3=GastosIngresos!$B13,Inscripciones!L$41,\"\")","v":""},{"$f":"IF(Inscripciones!M$3=GastosIngresos!$B13,Inscripciones!M$41,\"\")","v":""},{"$f":"IF(Inscripciones!N$3=GastosIngresos!$B13,Inscripciones!N$41,\"\")","v":""},{"$f":"IF(Inscripciones!O$3=GastosIngresos!$B13,Inscripciones!O$41,\"\")","v":""},{"$f":"IF(Inscripciones!P$3=GastosIngresos!$B13,Inscripciones!P$41,\"\")","v":""},{"$f":"IF(Inscripciones!Q$3=GastosIngresos!$B13,Inscripciones!Q$41,\"\")","v":""},{"$f":"IF(Inscripciones!R$3=GastosIngresos!$B13,Inscripciones!R$41,\"\")","v":""},{"$f":"IF(Inscripciones!S$3=GastosIngresos!$B13,Inscripciones!S$41,\"\")","v":""},{"$f":"IF(Inscripciones!T$3=GastosIngresos!$B13,Inscripciones!T$41,\"\")","v":""},{"$f":"IF(Inscripciones!U$3=GastosIngresos!$B13,Inscripciones!U$41,\"\")","v":""},{"$f":"IF(Inscripciones!V$3=GastosIngresos!$B13,Inscripciones!V$41,\"\")","v":""},{"$f":"IF(Inscripciones!W$3=GastosIngresos!$B13,Inscripciones!W$41,\"\")","v":""},{"$f":"IF(Inscripciones!X$3=GastosIngresos!$B13,Inscripciones!X$41,\"\")","v":""},{"$f":"IF(Inscripciones!Y$3=GastosIngresos!$B13,Inscripciones!Y$41,\"\")","v":""},{"$f":"IF(Inscripciones!Z$3=GastosIngresos!$B13,Inscripciones!Z$41,\"\")","v":""},{"$f":"IF(Inscripciones!AA$3=GastosIngresos!$B13,Inscripciones!AA$41,\"\")","v":""},{"$f":"IF(Inscripciones!AB$3=GastosIngresos!$B13,Inscripciones!AB$41,\"\")","v":""},{"$f":"IF(Inscripciones!AC$3=GastosIngresos!$B13,Inscripciones!AC$41,\"\")","v":""},{"$f":"IF(Inscripciones!AD$3=GastosIngresos!$B13,Inscripciones!AD$41,\"\")","v":""},{"$f":"IF(Inscripciones!AE$3=GastosIngresos!$B13,Inscripciones!AE$41,\"\")","v":""},{"$f":"IF(Inscripciones!AF$3=GastosIngresos!$B13,Inscripciones!AF$41,\"\")","v":""},{"$f":"IF(Inscripciones!AG$3=GastosIngresos!$B13,Inscripciones!AG$41,\"\")","v":""},{"$f":"IF(Inscripciones!AH$3=GastosIngresos!$B13,Inscripciones!AH$41,\"\")","v":""},{"$f":"IF(Inscripciones!AI$3=GastosIngresos!$B13,Inscripciones!AI$41,\"\")","v":""},{"$f":"IF(Inscripciones!AJ$3=GastosIngresos!$B13,Inscripciones!AJ$41,\"\")","v":""},{"$f":"IF(Inscripciones!AK$3=GastosIngresos!$B13,Inscripciones!AK$41,\"\")","v":""},{"$f":"IF(Inscripciones!AL$3=GastosIngresos!$B13,Inscripciones!AL$41,\"\")","v":""},{"$f":"IF(Inscripciones!AM$3=GastosIngresos!$B13,Inscripciones!AM$41,\"\")","v":""},{"$f":"IF(Inscripciones!AN$3=GastosIngresos!$B13,Inscripciones!AN$41,\"\")","v":""},{"$f":"IF(Inscripciones!AO$3=GastosIngresos!$B13,Inscripciones!AO$41,\"\")","v":""},{"$f":"IF(Inscripciones!AP$3=GastosIngresos!$B13,Inscripciones!AP$41,\"\")","v":""},{"$f":"IF(Inscripciones!AQ$3=GastosIngresos!$B13,Inscripciones!AQ$41,\"\")","v":""},{"$f":"IF(Inscripciones!AR$3=GastosIngresos!$B13,Inscripciones!AR$41,\"\")","v":""},{"$f":"IF(Inscripciones!AS$3=GastosIngresos!$B13,Inscripciones!AS$41,\"\")","v":""},{"$f":"IF(Inscripciones!AT$3=GastosIngresos!$B13,Inscripciones!AT$41,\"\")","v":""},{"$f":"IF(Inscripciones!AU$3=GastosIngresos!$B13,Inscripciones!AU$41,\"\")","v":""},{"$f":"IF(Inscripciones!AV$3=GastosIngresos!$B13,Inscripciones!AV$41,\"\")","v":""},{"$f":"IF(Inscripciones!AW$3=GastosIngresos!$B13,Inscripciones!AW$41,\"\")","v":""},{"$f":"IF(Inscripciones!AX$3=GastosIngresos!$B13,Inscripciones!AX$41,\"\")","v":""},{"$f":"IF(Inscripciones!AY$3=GastosIngresos!$B13,Inscripciones!AY$41,\"\")","v":""},{"$f":"IF(Inscripciones!AZ$3=GastosIngresos!$B13,Inscripciones!AZ$41,\"\")","v":""},{"$f":"IF(Inscripciones!BA$3=GastosIngresos!$B13,Inscripciones!BA$41,\"\")","v":""},{"$f":"IF(Inscripciones!BB$3=GastosIngresos!$B13,Inscripciones!BB$41,\"\")","v":""},{"$f":"IF(Inscripciones!BC$3=GastosIngresos!$B13,Inscripciones!BC$41,\"\")","v":""},{"$f":"IF(Inscripciones!BD$3=GastosIngresos!$B13,Inscripciones!BD$41,\"\")","v":""},0]
[]
["General",null,1,2,3,4,5,6,7,8,9,10,11,12,13,14,15,16,17,18,19,20,21,22,23,24,25,26,27,28,29,30,31,32,33,34,35,36,37,38,39,40,41,42,43,44,45,46,47,48,49,50,51,52,53,54,"Total"]
["Enero","E",{"$f":"IF(Inscripciones!C$3=$B16,General!C$41,\"\")","v":""},{"$f":"IF(Inscripciones!D$3=$B16,General!D$41,\"\")","v":""},{"$f":"IF(Inscripciones!E$3=$B16,General!E$41,\"\")","v":""},{"$f":"IF(Inscripciones!F$3=$B16,General!F$41,\"\")","v":""},{"$f":"IF(Inscripciones!G$3=$B16,General!G$41,\"\")","v":""},{"$f":"IF(Inscripciones!H$3=$B16,General!H$41,\"\")","v":""},{"$f":"IF(Inscripciones!I$3=$B16,General!I$41,\"\")","v":""},{"$f":"IF(Inscripciones!J$3=$B16,General!J$41,\"\")","v":""},{"$f":"IF(Inscripciones!K$3=$B16,General!K$41,\"\")","v":""},{"$f":"IF(Inscripciones!L$3=$B16,General!L$41,\"\")","v":""},{"$f":"IF(Inscripciones!M$3=$B16,General!M$41,\"\")","v":""},{"$f":"IF(Inscripciones!N$3=$B16,General!N$41,\"\")","v":""},{"$f":"IF(Inscripciones!O$3=$B16,General!O$41,\"\")","v":""},{"$f":"IF(Inscripciones!P$3=$B16,General!P$41,\"\")","v":""},{"$f":"IF(Inscripciones!Q$3=$B16,General!Q$41,\"\")","v":""},{"$f":"IF(Inscripciones!R$3=$B16,General!R$41,\"\")","v":""},{"$f":"IF(Inscripciones!S$3=$B16,General!S$41,\"\")","v":""},{"$f":"IF(Inscripciones!T$3=$B16,General!T$41,\"\")","v":""},{"$f":"IF(Inscripciones!U$3=$B16,General!U$41,\"\")","v":""},{"$f":"IF(Inscripciones!V$3=$B16,General!V$41,\"\")","v":""},{"$f":"IF(Inscripciones!W$3=$B16,General!W$41,\"\")","v":""},{"$f":"IF(Inscripciones!X$3=$B16,General!X$41,\"\")","v":""},{"$f":"IF(Inscripciones!Y$3=$B16,General!Y$41,\"\")","v":""},{"$f":"IF(Inscripciones!Z$3=$B16,General!Z$41,\"\")","v":""},{"$f":"IF(Inscripciones!AA$3=$B16,General!AA$41,\"\")","v":""},{"$f":"IF(Inscripciones!AB$3=$B16,General!AB$41,\"\")","v":""},{"$f":"IF(Inscripciones!AC$3=$B16,General!AC$41,\"\")","v":""},{"$f":"IF(Inscripciones!AD$3=$B16,General!AD$41,\"\")","v":""},{"$f":"IF(Inscripciones!AE$3=$B16,General!AE$41,\"\")","v":""},{"$f":"IF(Inscripciones!AF$3=$B16,General!AF$41,\"\")","v":""},{"$f":"IF(Inscripciones!AG$3=$B16,General!AG$41,\"\")","v":""},{"$f":"IF(Inscripciones!AH$3=$B16,General!AH$41,\"\")","v":""},{"$f":"IF(Inscripciones!AI$3=$B16,General!AI$41,\"\")","v":""},{"$f":"IF(Inscripciones!AJ$3=$B16,General!AJ$41,\"\")","v":""},{"$f":"IF(Inscripciones!AK$3=$B16,General!AK$41,\"\")","v":""},{"$f":"IF(Inscripciones!AL$3=$B16,General!AL$41,\"\")","v":""},{"$f":"IF(Inscripciones!AM$3=$B16,General!AM$41,\"\")","v":""},{"$f":"IF(Inscripciones!AN$3=$B16,General!AN$41,\"\")","v":""},{"$f":"IF(Inscripciones!AO$3=$B16,General!AO$41,\"\")","v":""},{"$f":"IF(Inscripciones!AP$3=$B16,General!AP$41,\"\")","v":""},{"$f":"IF(Inscripciones!AQ$3=$B16,General!AQ$41,\"\")","v":""},{"$f":"IF(Inscripciones!AR$3=$B16,General!AR$41,\"\")","v":""},{"$f":"IF(Inscripciones!AS$3=$B16,General!AS$41,\"\")","v":""},{"$f":"IF(Inscripciones!AT$3=$B16,General!AT$41,\"\")","v":""},{"$f":"IF(Inscripciones!AU$3=$B16,General!AU$41,\"\")","v":""},{"$f":"IF(Inscripciones!AV$3=$B16,General!AV$41,\"\")","v":""},{"$f":"IF(Inscripciones!AW$3=$B16,General!AW$41,\"\")","v":""},{"$f":"IF(Inscripciones!AX$3=$B16,General!AX$41,\"\")","v":""},{"$f":"IF(Inscripciones!AY$3=$B16,General!AY$41,\"\")","v":""},{"$f":"IF(Inscripciones!AZ$3=$B16,General!AZ$41,\"\")","v":""},{"$f":"IF(Inscripciones!BA$3=$B16,General!BA$41,\"\")","v":""},{"$f":"IF(Inscripciones!BB$3=$B16,General!BB$41,\"\")","v":""},{"$f":"IF(Inscripciones!BC$3=$B16,General!BC$41,\"\")","v":""},{"$f":"IF(Inscripciones!BD$3=$B16,General!BD$41,\"\")","v":""},{"$f":"SUM(C16:BD16)","v":0}]
["Febrero","F",{"$f":"IF(Inscripciones!C$3=$B17,General!C$41,\"\")","v":""},{"$f":"IF(Inscripciones!D$3=$B17,General!D$41,\"\")","v":""},{"$f":"IF(Inscripciones!E$3=$B17,General!E$41,\"\")","v":""},{"$f":"IF(Inscripciones!F$3=$B17,General!F$41,\"\")","v":""},{"$f":"IF(Inscripciones!G$3=$B17,General!G$41,\"\")","v":""},{"$f":"IF(Inscripciones!H$3=$B17,General!H$41,\"\")","v":""},{"$f":"IF(Inscripciones!I$3=$B17,General!I$41,\"\")","v":""},{"$f":"IF(Inscripciones!J$3=$B17,General!J$41,\"\")","v":""},{"$f":"IF(Inscripciones!K$3=$B17,General!K$41,\"\")","v":""},{"$f":"IF(Inscripciones!L$3=$B17,General!L$41,\"\")","v":""},{"$f":"IF(Inscripciones!M$3=$B17,General!M$41,\"\")","v":""},{"$f":"IF(Inscripciones!N$3=$B17,General!N$41,\"\")","v":""},{"$f":"IF(Inscripciones!O$3=$B17,General!O$41,\"\")","v":""},{"$f":"IF(Inscripciones!P$3=$B17,General!P$41,\"\")","v":""},{"$f":"IF(Inscripciones!Q$3=$B17,General!Q$41,\"\")","v":""},{"$f":"IF(Inscripciones!R$3=$B17,General!R$41,\"\")","v":""},{"$f":"IF(Inscripciones!S$3=$B17,General!S$41,\"\")","v":""},{"$f":"IF(Inscripciones!T$3=$B17,General!T$41,\"\")","v":""},{"$f":"IF(Inscripciones!U$3=$B17,General!U$41,\"\")","v":""},{"$f":"IF(Inscripciones!V$3=$B17,General!V$41,\"\")","v":""},{"$f":"IF(Inscripciones!W$3=$B17,General!W$41,\"\")","v":""},{"$f":"IF(Inscripciones!X$3=$B17,General!X$41,\"\")","v":""},{"$f":"IF(Inscripciones!Y$3=$B17,General!Y$41,\"\")","v":""},{"$f":"IF(Inscripciones!Z$3=$B17,General!Z$41,\"\")","v":""},{"$f":"IF(Inscripciones!AA$3=$B17,General!AA$41,\"\")","v":""},{"$f":"IF(Inscripciones!AB$3=$B17,General!AB$41,\"\")","v":""},{"$f":"IF(Inscripciones!AC$3=$B17,General!AC$41,\"\")","v":""},{"$f":"IF(Inscripciones!AD$3=$B17,General!AD$41,\"\")","v":""},{"$f":"IF(Inscripciones!AE$3=$B17,General!AE$41,\"\")","v":""},{"$f":"IF(Inscripciones!AF$3=$B17,General!AF$41,\"\")","v":""},{"$f":"IF(Inscripciones!AG$3=$B17,General!AG$41,\"\")","v":""},{"$f":"IF(Inscripciones!AH$3=$B17,General!AH$41,\"\")","v":""},{"$f":"IF(Inscripciones!AI$3=$B17,General!AI$41,\"\")","v":""},{"$f":"IF(Inscripciones!AJ$3=$B17,General!AJ$41,\"\")","v":""},{"$f":"IF(Inscripciones!AK$3=$B17,General!AK$41,\"\")","v":""},{"$f":"IF(Inscripciones!AL$3=$B17,General!AL$41,\"\")","v":""},{"$f":"IF(Inscripciones!AM$3=$B17,General!AM$41,\"\")","v":""},{"$f":"IF(Inscripciones!AN$3=$B17,General!AN$41,\"\")","v":""},{"$f":"IF(Inscripciones!AO$3=$B17,General!AO$41,\"\")","v":""},{"$f":"IF(Inscripciones!AP$3=$B17,General!AP$41,\"\")","v":""},{"$f":"IF(Inscripciones!AQ$3=$B17,General!AQ$41,\"\")","v":""},{"$f":"IF(Inscripciones!AR$3=$B17,General!AR$41,\"\")","v":""},{"$f":"IF(Inscripciones!AS$3=$B17,General!AS$41,\"\")","v":""},{"$f":"IF(Inscripciones!AT$3=$B17,General!AT$41,\"\")","v":""},{"$f":"IF(Inscripciones!AU$3=$B17,General!AU$41,\"\")","v":""},{"$f":"IF(Inscripciones!AV$3=$B17,General!AV$41,\"\")","v":""},{"$f":"IF(Inscripciones!AW$3=$B17,General!AW$41,\"\")","v":""},{"$f":"IF(Inscripciones!AX$3=$B17,General!AX$41,\"\")","v":""},{"$f":"IF(Inscripciones!AY$3=$B17,General!AY$41,\"\")","v":""},{"$f":"IF(Inscripciones!AZ$3=$B17,General!AZ$41,\"\")","v":""},{"$f":"IF(Inscripciones!BA$3=$B17,General!BA$41,\"\")","v":""},{"$f":"IF(Inscripciones!BB$3=$B17,General!BB$41,\"\")","v":""},{"$f":"IF(Inscripciones!BC$3=$B17,General!BC$41,\"\")","v":""},{"$f":"IF(Inscripciones!BD$3=$B17,General!BD$41,\"\")","v":""},{"$f":"SUM(C17:BD17)","v":0}]
["Marzo","M",{"$f":"IF(Inscripciones!C$3=$B18,General!C$41,\"\")","v":""},{"$f":"IF(Inscripciones!D$3=$B18,General!D$41,\"\")","v":""},{"$f":"IF(Inscripciones!E$3=$B18,General!E$41,\"\")","v":""},{"$f":"IF(Inscripciones!F$3=$B18,General!F$41,\"\")","v":""},{"$f":"IF(Inscripciones!G$3=$B18,General!G$41,\"\")","v":""},{"$f":"IF(Inscripciones!H$3=$B18,General!H$41,\"\")","v":""},{"$f":"IF(Inscripciones!I$3=$B18,General!I$41,\"\")","v":""},{"$f":"IF(Inscripciones!J$3=$B18,General!J$41,\"\")","v":""},{"$f":"IF(Inscripciones!K$3=$B18,General!K$41,\"\")","v":""},{"$f":"IF(Inscripciones!L$3=$B18,General!L$41,\"\")","v":""},{"$f":"IF(Inscripciones!M$3=$B18,General!M$41,\"\")","v":""},{"$f":"IF(Inscripciones!N$3=$B18,General!N$41,\"\")","v":""},{"$f":"IF(Inscripciones!O$3=$B18,General!O$41,\"\")","v":""},{"$f":"IF(Inscripciones!P$3=$B18,General!P$41,\"\")","v":""},{"$f":"IF(Inscripciones!Q$3=$B18,General!Q$41,\"\")","v":""},{"$f":"IF(Inscripciones!R$3=$B18,General!R$41,\"\")","v":""},{"$f":"IF(Inscripciones!S$3=$B18,General!S$41,\"\")","v":""},{"$f":"IF(Inscripciones!T$3=$B18,General!T$41,\"\")","v":""},{"$f":"IF(Inscripciones!U$3=$B18,General!U$41,\"\")","v":""},{"$f":"IF(Inscripciones!V$3=$B18,General!V$41,\"\")","v":""},{"$f":"IF(Inscripciones!W$3=$B18,General!W$41,\"\")","v":""},{"$f":"IF(Inscripciones!X$3=$B18,General!X$41,\"\")","v":""},{"$f":"IF(Inscripciones!Y$3=$B18,General!Y$41,\"\")","v":""},{"$f":"IF(Inscripciones!Z$3=$B18,General!Z$41,\"\")","v":""},{"$f":"IF(Inscripciones!AA$3=$B18,General!AA$41,\"\")","v":""},{"$f":"IF(Inscripciones!AB$3=$B18,General!AB$41,\"\")","v":""},{"$f":"IF(Inscripciones!AC$3=$B18,General!AC$41,\"\")","v":""},{"$f":"IF(Inscripciones!AD$3=$B18,General!AD$41,\"\")","v":""},{"$f":"IF(Inscripciones!AE$3=$B18,General!AE$41,\"\")","v":""},{"$f":"IF(Inscripciones!AF$3=$B18,General!AF$41,\"\")","v":""},{"$f":"IF(Inscripciones!AG$3=$B18,General!AG$41,\"\")","v":""},{"$f":"IF(Inscripciones!AH$3=$B18,General!AH$41,\"\")","v":""},{"$f":"IF(Inscripciones!AI$3=$B18,General!AI$41,\"\")","v":""},{"$f":"IF(Inscripciones!AJ$3=$B18,General!AJ$41,\"\")","v":""},{"$f":"IF(Inscripciones!AK$3=$B18,General!AK$41,\"\")","v":""},{"$f":"IF(Inscripciones!AL$3=$B18,General!AL$41,\"\")","v":""},{"$f":"IF(Inscripciones!AM$3=$B18,General!AM$41,\"\")","v":""},{"$f":"IF(Inscripciones!AN$3=$B18,General!AN$41,\"\")","v":""},{"$f":"IF(Inscripciones!AO$3=$B18,General!AO$41,\"\")","v":""},{"$f":"IF(Inscripciones!AP$3=$B18,General!AP$41,\"\")","v":""},{"$f":"IF(Inscripciones!AQ$3=$B18,General!AQ$41,\"\")","v":""},{"$f":"IF(Inscripciones!AR$3=$B18,General!AR$41,\"\")","v":""},{"$f":"IF(Inscripciones!AS$3=$B18,General!AS$41,\"\")","v":""},{"$f":"IF(Inscripciones!AT$3=$B18,General!AT$41,\"\")","v":""},{"$f":"IF(Inscripciones!AU$3=$B18,General!AU$41,\"\")","v":""},{"$f":"IF(Inscripciones!AV$3=$B18,General!AV$41,\"\")","v":""},{"$f":"IF(Inscripciones!AW$3=$B18,General!AW$41,\"\")","v":""},{"$f":"IF(Inscripciones!AX$3=$B18,General!AX$41,\"\")","v":""},{"$f":"IF(Inscripciones!AY$3=$B18,General!AY$41,\"\")","v":""},{"$f":"IF(Inscripciones!AZ$3=$B18,General!AZ$41,\"\")","v":""},{"$f":"IF(Inscripciones!BA$3=$B18,General!BA$41,\"\")","v":""},{"$f":"IF(Inscripciones!BB$3=$B18,General!BB$41,\"\")","v":""},{"$f":"IF(Inscripciones!BC$3=$B18,General!BC$41,\"\")","v":""},{"$f":"IF(Inscripciones!BD$3=$B18,General!BD$41,\"\")","v":""},0]
["Abril","A",{"$f":"IF(Inscripciones!C$3=$B19,General!C$41,\"\")","v":""},{"$f":"IF(Inscripciones!D$3=$B19,General!D$41,\"\")","v":""},{"$f":"IF(Inscripciones!E$3=$B19,General!E$41,\"\")","v":""},{"$f":"IF(Inscripciones!F$3=$B19,General!F$41,\"\")","v":""},{"$f":"IF(Inscripciones!G$3=$B19,General!G$41,\"\")","v":""},{"$f":"IF(Inscripciones!H$3=$B19,General!H$41,\"\")","v":""},{"$f":"IF(Inscripciones!I$3=$B19,General!I$41,\"\")","v":""},{"$f":"IF(Inscripciones!J$3=$B19,General!J$41,\"\")","v":""},{"$f":"IF(Inscripciones!K$3=$B19,General!K$41,\"\")","v":""},{"$f":"IF(Inscripciones!L$3=$B19,General!L$41,\"\")","v":""},{"$f":"IF(Inscripciones!M$3=$B19,General!M$41,\"\")","v":""},{"$f":"IF(Inscripciones!N$3=$B19,General!N$41,\"\")","v":""},{"$f":"IF(Inscripciones!O$3=$B19,General!O$41,\"\")","v":""},{"$f":"IF(Inscripciones!P$3=$B19,General!P$41,\"\")","v":""},{"$f":"IF(Inscripciones!Q$3=$B19,General!Q$41,\"\")","v":""},{"$f":"IF(Inscripciones!R$3=$B19,General!R$41,\"\")","v":""},{"$f":"IF(Inscripciones!S$3=$B19,General!S$41,\"\")","v":""},{"$f":"IF(Inscripciones!T$3=$B19,General!T$41,\"\")","v":""},{"$f":"IF(Inscripciones!U$3=$B19,General!U$41,\"\")","v":""},{"$f":"IF(Inscripciones!V$3=$B19,General!V$41,\"\")","v":""},{"$f":"IF(Inscripciones!W$3=$B19,General!W$41,\"\")","v":""},{"$f":"IF(Inscripciones!X$3=$B19,General!X$41,\"\")","v":""},{"$f":"IF(Inscripciones!Y$3=$B19,General!Y$41,\"\")","v":""},{"$f":"IF(Inscripciones!Z$3=$B19,General!Z$41,\"\")","v":""},{"$f":"IF(Inscripciones!AA$3=$B19,General!AA$41,\"\")","v":""},{"$f":"IF(Inscripciones!AB$3=$B19,General!AB$41,\"\")","v":""},{"$f":"IF(Inscripciones!AC$3=$B19,General!AC$41,\"\")","v":""},{"$f":"IF(Inscripciones!AD$3=$B19,General!AD$41,\"\")","v":""},{"$f":"IF(Inscripciones!AE$3=$B19,General!AE$41,\"\")","v":""},{"$f":"IF(Inscripciones!AF$3=$B19,General!AF$41,\"\")","v":""},{"$f":"IF(Inscripciones!AG$3=$B19,General!AG$41,\"\")","v":""},{"$f":"IF(Inscripciones!AH$3=$B19,General!AH$41,\"\")","v":""},{"$f":"IF(Inscripciones!AI$3=$B19,General!AI$41,\"\")","v":""},{"$f":"IF(Inscripciones!AJ$3=$B19,General!AJ$41,\"\")","v":""},{"$f":"IF(Inscripciones!AK$3=$B19,General!AK$41,\"\")","v":""},{"$f":"IF(Inscripciones!AL$3=$B19,General!AL$41,\"\")","v":""},{"$f":"IF(Inscripciones!AM$3=$B19,General!AM$41,\"\")","v":""},{"$f":"IF(Inscripciones!AN$3=$B19,General!AN$41,\"\")","v":""},{"$f":"IF(Inscripciones!AO$3=$B19,General!AO$41,\"\")","v":""},{"$f":"IF(Inscripciones!AP$3=$B19,General!AP$41,\"\")","v":""},{"$f":"IF(Inscripciones!AQ$3=$B19,General!AQ$41,\"\")","v":""},{"$f":"IF(Inscripciones!AR$3=$B19,General!AR$41,\"\")","v":""},{"$f":"IF(Inscripciones!AS$3=$B19,General!AS$41,\"\")","v":""},{"$f":"IF(Inscripciones!AT$3=$B19,General!AT$41,\"\")","v":""},{"$f":"IF(Inscripciones!AU$3=$B19,General!AU$41,\"\")","v":""},{"$f":"IF(Inscripciones!AV$3=$B19,General!AV$41,\"\")","v":""},{"$f":"IF(Inscripciones!AW$3=$B19,General!AW$41,\"\")","v":""},{"$f":"IF(Inscripciones!AX$3=$B19,General!AX$41,\"\")","v":""},{"$f":"IF(Inscripciones!AY$3=$B19,General!AY$41,\"\")","v":""},{"$f":"IF(Inscripciones!AZ$3=$B19,General!AZ$41,\"\")","v":""},{"$f":"IF(Inscripciones!BA$3=$B19,General!BA$41,\"\")","v":""},{"$f":"IF(Inscripciones!BB$3=$B19,General!BB$41,\"\")","v":""},{"$f":"IF(Inscripciones!BC$3=$B19,General!BC$41,\"\")","v":""},{"$f":"IF(Inscripciones!BD$3=$B19,General!BD$41,\"\")","v":""},0]
["Mayo","My",{"$f":"IF(Inscripciones!C$3=$B20,General!C$41,\"\")","v":""},{"$f":"IF(Inscripciones!D$3=$B20,General!D$41,\"\")","v":""},{"$f":"IF(Inscripciones!E$3=$B20,General!E$41,\"\")","v":""},{"$f":"IF(Inscripciones!F$3=$B20,General!F$41,\"\")","v":""},{"$f":"IF(Inscripciones!G$3=$B20,General!G$41,\"\")","v":""},{"$f":"IF(Inscripciones!H$3=$B20,General!H$41,\"\")","v":""},{"$f":"IF(Inscripciones!I$3=$B20,General!I$41,\"\")","v":""},{"$f":"IF(Inscripciones!J$3=$B20,General!J$41,\"\")","v":""},{"$f":"IF(Inscripciones!K$3=$B20,General!K$41,\"\")","v":""},{"$f":"IF(Inscripciones!L$3=$B20,General!L$41,\"\")","v":""},{"$f":"IF(Inscripciones!M$3=$B20,General!M$41,\"\")","v":""},{"$f":"IF(Inscripciones!N$3=$B20,General!N$41,\"\")","v":""},{"$f":"IF(Inscripciones!O$3=$B20,General!O$41,\"\")","v":""},{"$f":"IF(Inscripciones!P$3=$B20,General!P$41,\"\")","v":""},{"$f":"IF(Inscripciones!Q$3=$B20,General!Q$41,\"\")","v":""},{"$f":"IF(Inscripciones!R$3=$B20,General!R$41,\"\")","v":""},{"$f":"IF(Inscripciones!S$3=$B20,General!S$41,\"\")","v":""},{"$f":"IF(Inscripciones!T$3=$B20,General!T$41,\"\")","v":""},{"$f":"IF(Inscripciones!U$3=$B20,General!U$41,\"\")","v":""},{"$f":"IF(Inscripciones!V$3=$B20,General!V$41,\"\")","v":""},{"$f":"IF(Inscripciones!W$3=$B20,General!W$41,\"\")","v":""},{"$f":"IF(Inscripciones!X$3=$B20,General!X$41,\"\")","v":""},{"$f":"IF(Inscripciones!Y$3=$B20,General!Y$41,\"\")","v":""},{"$f":"IF(Inscripciones!Z$3=$B20,General!Z$41,\"\")","v":""},{"$f":"IF(Inscripciones!AA$3=$B20,General!AA$41,\"\")","v":""},{"$f":"IF(Inscripciones!AB$3=$B20,General!AB$41,\"\")","v":""},{"$f":"IF(Inscripciones!AC$3=$B20,General!AC$41,\"\")","v":""},{"$f":"IF(Inscripciones!AD$3=$B20,General!AD$41,\"\")","v":""},{"$f":"IF(Inscripciones!AE$3=$B20,General!AE$41,\"\")","v":0},{"$f":"IF(Inscripciones!AF$3=$B20,General!AF$41,\"\")","v":0},{"$f":"IF(Inscripciones!AG$3=$B20,General!AG$41,\"\")","v":0},{"$f":"IF(Inscripciones!AH$3=$B20,General!AH$41,\"\")","v":0},{"$f":"IF(Inscripciones!AI$3=$B20,General!AI$41,\"\")","v":0},{"$f":"IF(Inscripciones!AJ$3=$B20,General!AJ$41,\"\")","v":0},{"$f":"IF(Inscripciones!AK$3=$B20,General!AK$41,\"\")","v":0},{"$f":"IF(Inscripciones!AL$3=$B20,General!AL$41,\"\")","v":0},{"$f":"IF(Inscripciones!AM$3=$B20,General!AM$41,\"\")","v":0},{"$f":"IF(Inscripciones!AN$3=$B20,General!AN$41,\"\")","v":0},{"$f":"IF(Inscripciones!AO$3=$B20,General!AO$41,\"\")","v":0},{"$f":"IF(Inscripciones!AP$3=$B20,General!AP$41,\"\")","v":0},{"$f":"IF(Inscripciones!AQ$3=$B20,General!AQ$41,\"\")","v":0},{"$f":"IF(Inscripciones!AR$3=$B20,General!AR$41,\"\")","v":0},{"$f":"IF(Inscripciones!AS$3=$B20,General!AS$41,\"\")","v":0},{"$f":"IF(Inscripciones!AT$3=$B20,General!AT$41,\"\")","v":0},{"$f":"IF(Inscripciones!AU$3=$B20,General!AU$41,\"\")","v":""},{"$f":"IF(Inscripciones!AV$3=$B20,General!AV$41,\"\")","v":""},{"$f":"IF(Inscripciones!AW$3=$B20,General!AW$41,\"\")","v":""},{"$f":"IF(Inscripciones!AX$3=$B20,General!AX$41,\"\")","v":""},{"$f":"IF(Inscripciones!AY$3=$B20,General!AY$41,\"\")","v":""},{"$f":"IF(Inscripciones!AZ$3=$B20,General!AZ$41,\"\")","v":""},{"$f":"IF(Inscripciones!BA$3=$B20,General!BA$41,\"\")","v":""},{"$f":"IF(Inscripciones!BB$3=$B20,General!BB$41,\"\")","v":""},{"$f":"IF(Inscripciones!BC$3=$B20,General!BC$41,\"\")","v":""},{"$f":"IF(Inscripciones!BD$3=$B20,General!BD$41,\"\")","v":""},0]
["Junio","J",{"$f":"IF(Inscripciones!C$3=$B21,General!C$41,\"\")","v":""},{"$f":"IF(Inscripciones!D$3=$B21,General!D$41,\"\")","v":""},{"$f":"IF(Inscripciones!E$3=$B21,General!E$41,\"\")","v":""},{"$f":"IF(Inscripciones!F$3=$B21,General!F$41,\"\")","v":""},{"$f":"IF(Inscripciones!G$3=$B21,General!G$41,\"\")","v":""},{"$f":"IF(Inscripciones!H$3=$B21,General!H$41,\"\")","v":""},{"$f":"IF(Inscripciones!I$3=$B21,General!I$41,\"\")","v":""},{"$f":"IF(Inscripciones!J$3=$B21,General!J$41,\"\")","v":""},{"$f":"IF(Inscripciones!K$3=$B21,General!K$41,\"\")","v":""},{"$f":"IF(Inscripciones!L$3=$B21,General!L$41,\"\")","v":""},{"$f":"IF(Inscripciones!M$3=$B21,General!M$41,\"\")","v":""},{"$f":"IF(Inscripciones!N$3=$B21,General!N$41,\"\")","v":""},{"$f":"IF(Inscripciones!O$3=$B21,General!O$41,\"\")","v":""},{"$f":"IF(Inscripciones!P$3=$B21,General!P$41,\"\")","v":""},{"$f":"IF(Inscripciones!Q$3=$B21,General!Q$41,\"\")","v":""},{"$f":"IF(Inscripciones!R$3=$B21,General!R$41,\"\")","v":""},{"$f":"IF(Inscripciones!S$3=$B21,General!S$41,\"\")","v":""},{"$f":"IF(Inscripciones!T$3=$B21,General!T$41,\"\")","v":""},{"$f":"IF(Inscripciones!U$3=$B21,General!U$41,\"\")","v":""},{"$f":"IF(Inscripciones!V$3=$B21,General!V$41,\"\")","v":""},{"$f":"IF(Inscripciones!W$3=$B21,General!W$41,\"\")","v":""},{"$f":"IF(Inscripciones!X$3=$B21,General!X$41,\"\")","v":""},{"$f":"IF(Inscripciones!Y$3=$B21,General!Y$41,\"\")","v":""},{"$f":"IF(Inscripciones!Z$3=$B21,General!Z$41,\"\")","v":""},{"$f":"IF(Inscripciones!AA$3=$B21,General!AA$41,\"\")","v":""},{"$f":"IF(Inscripciones!AB$3=$B21,General!AB$41,\"\")","v":""},{"$f":"IF(Inscripciones!AC$3=$B21,General!AC$41,\"\")","v":""},{"$f":"IF(Inscripciones!AD$3=$B21,General!AD$41,\"\")","v":""},{"$f":"IF(Inscripciones!AE$3=$B21,General!AE$41,\"\")","v":""},{"$f":"IF(Inscripciones!AF$3=$B21,General!AF$41,\"\")","v":""},{"$f":"IF(Inscripciones!AG$3=$B21,General!AG$41,\"\")","v":""},{"$f":"IF(Inscripciones!AH$3=$B21,General!AH$41,\"\")","v":""},{"$f":"IF(Inscripciones!AI$3=$B21,General!AI$41,\"\")","v":""},{"$f":"IF(Inscripciones!AJ$3=$B21,General!AJ$41,\"\")","v":""},{"$f":"IF(Inscripciones!AK$3=$B21,General!AK$41,\"\")","v":""},{"$f":"IF(Inscripciones!AL$3=$B21,General!AL$41,\"\")","v":""},{"$f":"IF(Inscripciones!AM$3=$B21,General!AM$41,\"\")","v":""},{"$f":"IF(Inscripciones!AN$3=$B21,General!AN$41,\"\")","v":""},{"$f":"IF(Inscripciones!AO$3=$B21,General!AO$41,\"\")","v":""},{"$f":"IF(Inscripciones!AP$3=$B21,General!AP$41,\"\")","v":""},{"$f":"IF(Inscripciones!AQ$3=$B21,General!AQ$41,\"\")","v":""},{"$f":"IF(Inscripciones!AR$3=$B21,General!AR$41,\"\")","v":""},{"$f":"IF(Inscripciones!AS$3=$B21,General!AS$41,\"\")","v":""},{"$f":"IF(Inscripciones!AT$3=$B21,General!AT$41,\"\")","v":""},{"$f":"IF(Inscripciones!AU$3=$B21,General!AU$41,\"\")","v":0},{"$f":"IF(Inscripciones!AV$3=$B21,General!AV$41,\"\")","v":0},{"$f":"IF(Inscripciones!AW$3=$B21,General!AW$41,\"\")","v":0},{"$f":"IF(Inscripciones!AX$3=$B21,General!AX$41,\"\")","v":0},{"$f":"IF(Inscripciones!AY$3=$B21,General!AY$41,\"\")","v":0},{"$f":"IF(Inscripciones!AZ$3=$B21,General!AZ$41,\"\")","v":0},{"$f":"IF(Inscripciones!BA$3=$B21,General!BA$41,\"\")","v":0},{"$f":"IF(Inscripciones!BB$3=$B21,General!BB$41,\"\")","v":0},{"$f":"IF(Inscripciones!BC$3=$B21,General!BC$41,\"\")","v":0},{"$f":"IF(Inscripciones!BD$3=$B21,General!BD$41,\"\")","v":""},0]
["Julio","Jl",{"$f":"IF(Inscripciones!C$3=$B22,General!C$41,\"\")","v":""},{"$f":"IF(Inscripciones!D$3=$B22,General!D$41,\"\")","v":""},{"$f":"IF(Inscripciones!E$3=$B22,General!E$41,\"\")","v":""},{"$f":"IF(Inscripciones!F$3=$B22,General!F$41,\"\")","v":""},{"$f":"IF(Inscripciones!G$3=$B22,General!G$41,\"\")","v":""},{"$f":"IF(Inscripciones!H$3=$B22,General!H$41,\"\")","v":""},{"$f":"IF(Inscripciones!I$3=$B22,General!I$41,\"\")","v":""},{"$f":"IF(Inscripciones!J$3=$B22,General!J$41,\"\")","v":""},{"$f":"IF(Inscripciones!K$3=$B22,General!K$41,\"\")","v":""},{"$f":"IF(Inscripciones!L$3=$B22,General!L$41,\"\")","v":""},{"$f":"IF(Inscripciones!M$3=$B22,General!M$41,\"\")","v":""},{"$f":"IF(Inscripciones!N$3=$B22,General!N$41,\"\")","v":""},{"$f":"IF(Inscripciones!O$3=$B22,General!O$41,\"\")","v":""},{"$f":"IF(Inscripciones!P$3=$B22,General!P$41,\"\")","v":""},{"$f":"IF(Inscripciones!Q$3=$B22,General!Q$41,\"\")","v":""},{"$f":"IF(Inscripciones!R$3=$B22,General!R$41,\"\")","v":""},{"$f":"IF(Inscripciones!S$3=$B22,General!S$41,\"\")","v":""},{"$f":"IF(Inscripciones!T$3=$B22,General!T$41,\"\")","v":""},{"$f":"IF(Inscripciones!U$3=$B22,General!U$41,\"\")","v":""},{"$f":"IF(Inscripciones!V$3=$B22,General!V$41,\"\")","v":""},{"$f":"IF(Inscripciones!W$3=$B22,General!W$41,\"\")","v":""},{"$f":"IF(Inscripciones!X$3=$B22,General!X$41,\"\")","v":""},{"$f":"IF(Inscripciones!Y$3=$B22,General!Y$41,\"\")","v":""},{"$f":"IF(Inscripciones!Z$3=$B22,General!Z$41,\"\")","v":""},{"$f":"IF(Inscripciones!AA$3=$B22,General!AA$41,\"\")","v":""},{"$f":"IF(Inscripciones!AB$3=$B22,General!AB$41,\"\")","v":""},{"$f":"IF(Inscripciones!AC$3=$B22,General!AC$41,\"\")","v":""},{"$f":"IF(Inscripciones!AD$3=$B22,General!AD$41,\"\")","v":""},{"$f":"IF(Inscripciones!AE$3=$B22,General!AE$41,\"\")","v":""},{"$f":"IF(Inscripciones!AF$3=$B22,General!AF$41,\"\")","v":""},{"$f":"IF(Inscripciones!AG$3=$B22,General!AG$41,\"\")","v":""},{"$f":"IF(Inscripciones!AH$3=$B22,General!AH$41,\"\")","v":""},{"$f":"IF(Inscripciones!AI$3=$B22,General!AI$41,\"\")","v":""},{"$f":"IF(Inscripciones!AJ$3=$B22,General!AJ$41,\"\")","v":""},{"$f":"IF(Inscripciones!AK$3=$B22,General!AK$41,\"\")","v":""},{"$f":"IF(Inscripciones!AL$3=$B22,General!AL$41,\"\")","v":""},{"$f":"IF(Inscripciones!AM$3=$B22,General!AM$41,\"\")","v":""},{"$f":"IF(Inscripciones!AN$3=$B22,General!AN$41,\"\")","v":""},{"$f":"IF(Inscripciones!AO$3=$B22,General!AO$41,\"\")","v":""},{"$f":"IF(Inscripciones!AP$3=$B22,General!AP$41,\"\")","v":""},{"$f":"IF(Inscripciones!AQ$3=$B22,General!AQ$41,\"\")","v":""},{"$f":"IF(Inscripciones!AR$3=$B22,General!AR$41,\"\")","v":""},{"$f":"IF(Inscripciones!AS$3=$B22,General!AS$41,\"\")","v":""},{"$f":"IF(Inscripciones!AT$3=$B22,General!AT$41,\"\")","v":""},{"$f":"IF(Inscripciones!AU$3=$B22,General!AU$41,\"\")","v":""},{"$f":"IF(Inscripciones!AV$3=$B22,General!AV$41,\"\")","v":""},{"$f":"IF(Inscripciones!AW$3=$B22,General!AW$41,\"\")","v":""},{"$f":"IF(Inscripciones!AX$3=$B22,General!AX$41,\"\")","v":""},{"$f":"IF(Inscripciones!AY$3=$B22,General!AY$41,\"\")","v":""},{"$f":"IF(Inscripciones!AZ$3=$B22,General!AZ$41,\"\")","v":""},{"$f":"IF(Inscripciones!BA$3=$B22,General!BA$41,\"\")","v":""},{"$f":"IF(Inscripciones!BB$3=$B22,General!BB$41,\"\")","v":""},{"$f":"IF(Inscripciones!BC$3=$B22,General!BC$41,\"\")","v":""},{"$f":"IF(Inscripciones!BD$3=$B22,General!BD$41,\"\")","v":""},0]
["Agosto","Ag",{"$f":"IF(Inscripciones!C$3=$B23,General!C$41,\"\")","v":0},{"$f":"IF(Inscripciones!D$3=$B23,General!D$41,\"\")","v":0},{"$f":"IF(Inscripciones!E$3=$B23,General!E$41,\"\")","v":0},{"$f":"IF(Inscripciones!F$3=$B23,General!F$41,\"\")","v":0},{"$f":"IF(Inscripciones!G$3=$B23,General!G$41,\"\")","v":0},{"$f":"IF(Inscripciones!H$3=$B23,General!H$41,\"\")","v":0},{"$f":"IF(Inscripciones!I$3=$B23,General!I$41,\"\")","v":0},{"$f":"IF(Inscripciones!J$3=$B23,General!J$41,\"\")","v":0},{"$f":"IF(Inscripciones!K$3=$B23,General!K$41,\"\")","v":0},{"$f":"IF(Inscripciones!L$3=$B23,General!L$41,\"\")","v":0},{"$f":"IF(Inscripciones!M$3=$B23,General!M$41,\"\")","v":""},{"$f":"IF(Inscripciones!N$3=$B23,General!N$41,\"\")","v":""},{"$f":"IF(Inscripciones!O$3=$B23,General!O$41,\"\")","v":""},{"$f":"IF(Inscripciones!P$3=$B23,General!P$41,\"\")","v":""},{"$f":"IF(Inscripciones!Q$3=$B23,General!Q$41,\"\")","v":""},{"$f":"IF(Inscripciones!R$3=$B23,General!R$41,\"\")","v":""},{"$f":"IF(Inscripciones!S$3=$B23,General!S$41,\"\")","v":""},{"$f":"IF(Inscripciones!T$3=$B23,General!T$41,\"\")","v":""},{"$f":"IF(Inscripciones!U$3=$B23,General!U$41,\"\")","v":""},{"$f":"IF(Inscripciones!V$3=$B23,General!V$41,\"\")","v":""},{"$f":"IF(Inscripciones!W$3=$B23,General!W$41,\"\")","v":""},{"$f":"IF(Inscripciones!X$3=$B23,General!X$41,\"\")","v":""},{"$f":"IF(Inscripciones!Y$3=$B23,General!Y$41,\"\")","v":""},{"$f":"IF(Inscripciones!Z$3=$B23,General!Z$41,\"\")","v":""},{"$f":"IF(Inscripciones!AA$3=$B23,General!AA$41,\"\")","v":""},{"$f":"IF(Inscripciones!AB$3=$B23,General!AB$41,\"\")","v":""},{"$f":"IF(Inscripciones!AC$3=$B23,General!AC$41,\"\")","v":""},{"$f":"IF(Inscripciones!AD$3=$B23,General!AD$41,\"\")","v":""},{"$f":"IF(Inscripciones!AE$3=$B23,General!AE$41,\"\")","v":""},{"$f":"IF(Inscripciones!AF$3=$B23,General!AF$41,\"\")","v":""},{"$f":"IF(Inscripciones!AG$3=$B23,General!AG$41,\"\")","v":""},{"$f":"IF(Inscripciones!AH$3=$B23,General!AH$41,\"\")","v":""},{"$f":"IF(Inscripciones!AI$3=$B23,General!AI$41,\"\")","v":""},{"$f":"IF(Inscripciones!AJ$3=$B23,General!AJ$41,\"\")","v":""},{"$f":"IF(Inscripciones!AK$3=$B23,General!AK$41,\"\")","v":""},{"$f":"IF(Inscripciones!AL$3=$B23,General!AL$41,\"\")","v":""},{"$f":"IF(Inscripciones!AM$3=$B23,General!AM$41,\"\")","v":""},{"$f":"IF(Inscripciones!AN$3=$B23,General!AN$41,\"\")","v":""},{"$f":"IF(Inscripciones!AO$3=$B23,General!AO$41,\"\")","v":""},{"$f":"IF(Inscripciones!AP$3=$B23,General!AP$41,\"\")","v":""},{"$f":"IF(Inscripciones!AQ$3=$B23,General!AQ$41,\"\")","v":""},{"$f":"IF(Inscripciones!AR$3=$B23,General!AR$41,\"\")","v":""},{"$f":"IF(Inscripciones!AS$3=$B23,General!AS$41,\"\")","v":""},{"$f":"IF(Inscripciones!AT$3=$B23,General!AT$41,\"\")","v":""},{"$f":"IF(Inscripciones!AU$3=$B23,General!AU$41,\"\")","v":""},{"$f":"IF(Inscripciones!AV$3=$B23,General!AV$41,\"\")","v":""},{"$f":"IF(Inscripciones!AW$3=$B23,General!AW$41,\"\")","v":""},{"$f":"IF(Inscripciones!AX$3=$B23,General!AX$41,\"\")","v":""},{"$f":"IF(Inscripciones!AY$3=$B23,General!AY$41,\"\")","v":""},{"$f":"IF(Inscripciones!AZ$3=$B23,General!AZ$41,\"\")","v":""},{"$f":"IF(Inscripciones!BA$3=$B23,General!BA$41,\"\")","v":""},{"$f":"IF(Inscripciones!BB$3=$B23,General!BB$41,\"\")","v":""},{"$f":"IF(Inscripciones!BC$3=$B23,General!BC$41,\"\")","v":""},{"$f":"IF(Inscripciones!BD$3=$B23,General!BD$41,\"\")","v":""},0]
["Septiembre","S",{"$f":"IF(Inscripciones!C$3=$B24,General!C$41,\"\")","v":""},{"$f":"IF(Inscripciones!D$3=$B24,General!D$41,\"\")","v":""},{"$f":"IF(Inscripciones!E$3=$B24,General!E$41,\"\")","v":""},{"$f":"IF(Inscripciones!F$3=$B24,General!F$41,\"\")","v":""},{"$f":"IF(Inscripciones!G$3=$B24,General!G$41,\"\")","v":""},{"$f":"IF(Inscripciones!H$3=$B24,General!H$41,\"\")","v":""},{"$f":"IF(Inscripciones!I$3=$B24,General!I$41,\"\")","v":""},{"$f":"IF(Inscripciones!J$3=$B24,General!J$41,\"\")","v":""},{"$f":"IF(Inscripciones!K$3=$B24,General!K$41,\"\")","v":""},{"$f":"IF(Inscripciones!L$3=$B24,General!L$41,\"\")","v":""},{"$f":"IF(Inscripciones!M$3=$B24,General!M$41,\"\")","v":0},{"$f":"IF(Inscripciones!N$3=$B24,General!N$41,\"\")","v":0},{"$f":"IF(Inscripciones!O$3=$B24,General!O$41,\"\")","v":0},{"$f":"IF(Inscripciones!P$3=$B24,General!P$41,\"\")","v":0},{"$f":"IF(Inscripciones!Q$3=$B24,General!Q$41,\"\")","v":0},{"$f":"IF(Inscripciones!R$3=$B24,General!R$41,\"\")","v":""},{"$f":"IF(Inscripciones!S$3=$B24,General!S$41,\"\")","v":""},{"$f":"IF(Inscripciones!T$3=$B24,General!T$41,\"\")","v":""},{"$f":"IF(Inscripciones!U$3=$B24,General!U$41,\"\")","v":""},{"$f":"IF(Inscripciones!V$3=$B24,General!V$41,\"\")","v":""},{"$f":"IF(Inscripciones!W$3=$B24,General!W$41,\"\")","v":""},{"$f":"IF(Inscripciones!X$3=$B24,General!X$41,\"\")","v":""},{"$f":"IF(Inscripciones!Y$3=$B24,General!Y$41,\"\")","v":""},{"$f":"IF(Inscripciones!Z$3=$B24,General!Z$41,\"\")","v":""},{"$f":"IF(Inscripciones!AA$3=$B24,General!AA$41,\"\")","v":""},{"$f":"IF(Inscripciones!AB$3=$B24,General!AB$41,\"\")","v":""},{"$f":"IF(Inscripciones!AC$3=$B24,General!AC$41,\"\")","v":""},{"$f":"IF(Inscripciones!AD$3=$B24,General!AD$41,\"\")","v":""},{"$f":"IF(Inscripciones!AE$3=$B24,General!AE$41,\"\")","v":""},{"$f":"IF(Inscripciones!AF$3=$B24,General!AF$41,\"\")","v":""},{"$f":"IF(Inscripciones!AG$3=$B24,General!AG$41,\"\")","v":""},{"$f":"IF(Inscripciones!AH$3=$B24,General!AH$41,\"\")","v":""},{"$f":"IF(Inscripciones!AI$3=$B24,General!AI$41,\"\")","v":""},{"$f":"IF(Inscripciones!AJ$3=$B24,General!AJ$41,\"\")","v":""},{"$f":"IF(Inscripciones!AK$3=$B24,General!AK$41,\"\")","v":""},{"$f":"IF(Inscripciones!AL$3=$B24,General!AL$41,\"\")","v":""},{"$f":"IF(Inscripciones!AM$3=$B24,General!AM$41,\"\")","v":""},{"$f":"IF(Inscripciones!AN$3=$B24,General!AN$41,\"\")","v":""},{"$f":"IF(Inscripciones!AO$3=$B24,General!AO$41,\"\")","v":""},{"$f":"IF(Inscripciones!AP$3=$B24,General!AP$41,\"\")","v":""},{"$f":"IF(Inscripciones!AQ$3=$B24,General!AQ$41,\"\")","v":""},{"$f":"IF(Inscripciones!AR$3=$B24,General!AR$41,\"\")","v":""},{"$f":"IF(Inscripciones!AS$3=$B24,General!AS$41,\"\")","v":""},{"$f":"IF(Inscripciones!AT$3=$B24,General!AT$41,\"\")","v":""},{"$f":"IF(Inscripciones!AU$3=$B24,General!AU$41,\"\")","v":""},{"$f":"IF(Inscripciones!AV$3=$B24,General!AV$41,\"\")","v":""},{"$f":"IF(Inscripciones!AW$3=$B24,General!AW$41,\"\")","v":""},{"$f":"IF(Inscripciones!AX$3=$B24,General!AX$41,\"\")","v":""},{"$f":"IF(Inscripciones!AY$3=$B24,General!AY$41,\"\")","v":""},{"$f":"IF(Inscripciones!AZ$3=$B24,General!AZ$41,\"\")","v":""},{"$f":"IF(Inscripciones!BA$3=$B24,General!BA$41,\"\")","v":""},{"$f":"IF(Inscripciones!BB$3=$B24,General!BB$41,\"\")","v":""},{"$f":"IF(Inscripciones!BC$3=$B24,General!BC$41,\"\")","v":""},{"$f":"IF(Inscripciones!BD$3=$B24,General!BD$41,\"\")","v":""},0]
["Octubre","O",{"$f":"IF(Inscripciones!C$3=$B25,General!C$41,\"\")","v":""},{"$f":"IF(Inscripciones!D$3=$B25,General!D$41,\"\")","v":""},{"$f":"IF(Inscripciones!E$3=$B25,General!E$41,\"\")","v":""},{"$f":"IF(Inscripciones!F$3=$B25,General!F$41,\"\")","v":""},{"$f":"IF(Inscripciones!G$3=$B25,General!G$41,\"\")","v":""},{"$f":"IF(Inscripciones!H$3=$B25,General!H$41,\"\")","v":""},{"$f":"IF(Inscripciones!I$3=$B25,General!I$41,\"\")","v":""},{"$f":"IF(Inscripciones!J$3=$B25,General!J$41,\"\")","v":""},{"$f":"IF(Inscripciones!K$3=$B25,General!K$41,\"\")","v":""},{"$f":"IF(Inscripciones!L$3=$B25,General!L$41,\"\")","v":""},{"$f":"IF(Inscripciones!M$3=$B25,General!M$41,\"\")","v":""},{"$f":"IF(Inscripciones!N$3=$B25,General!N$41,\"\")","v":""},{"$f":"IF(Inscripciones!O$3=$B25,General!O$41,\"\")","v":""},{"$f":"IF(Inscripciones!P$3=$B25,General!P$41,\"\")","v":""},{"$f":"IF(Inscripciones!Q$3=$B25,General!Q$41,\"\")","v":""},{"$f":"IF(Inscripciones!R$3=$B25,General!R$41,\"\")","v":0},{"$f":"IF(Inscripciones!S$3=$B25,General!S$41,\"\")","v":0},{"$f":"IF(Inscripciones!T$3=$B25,General!T$41,\"\")","v":0},{"$f":"IF(Inscripciones!U$3=$B25,General!U$41,\"\")","v":0},{"$f":"IF(Inscripciones!V$3=$B25,General!V$41,\"\")","v":0},{"$f":"IF(Inscripciones!W$3=$B25,General!W$41,\"\")","v":0},{"$f":"IF(Inscripciones!X$3=$B25,General!X$41,\"\")","v":0},{"$f":"IF(Inscripciones!Y$3=$B25,General!Y$41,\"\")","v":0},{"$f":"IF(Inscripciones!Z$3=$B25,General!Z$41,\"\")","v":""},{"$f":"IF(Inscripciones!AA$3=$B25,General!AA$41,\"\")","v":""},{"$f":"IF(Inscripciones!AB$3=$B25,General!AB$41,\"\")","v":""},{"$f":"IF(Inscripciones!AC$3=$B25,General!AC$41,\"\")","v":""},{"$f":"IF(Inscripciones!AD$3=$B25,General!AD$41,\"\")","v":""},{"$f":"IF(Inscripciones!AE$3=$B25,General!AE$41,\"\")","v":""},{"$f":"IF(Inscripciones!AF$3=$B25,General!AF$41,\"\")","v":""},{"$f":"IF(Inscripciones!AG$3=$B25,General!AG$41,\"\")","v":""},{"$f":"IF(Inscripciones!AH$3=$B25,General!AH$41,\"\")","v":""},{"$f":"IF(Inscripciones!AI$3=$B25,General!AI$41,\"\")","v":""},{"$f":"IF(Inscripciones!AJ$3=$B25,General!AJ$41,\"\")","v":""},{"$f":"IF(Inscripciones!AK$3=$B25,General!AK$41,\"\")","v":""},{"$f":"IF(Inscripciones!AL$3=$B25,General!AL$41,\"\")","v":""},{"$f":"IF(Inscripciones!AM$3=$B25,General!AM$41,\"\")","v":""},{"$f":"IF(Inscripciones!AN$3=$B25,General!AN$41,\"\")","v":""},{"$f":"IF(Inscripciones!AO$3=$B25,General!AO$41,\"\")","v":""},{"$f":"IF(Inscripciones!AP$3=$B25,General!AP$41,\"\")","v":""},{"$f":"IF(Inscripciones!AQ$3=$B25,General!AQ$41,\"\")","v":""},{"$f":"IF(Inscripciones!AR$3=$B25,General!AR$41,\"\")","v":""},{"$f":"IF(Inscripciones!AS$3=$B25,General!AS$41,\"\")","v":""},{"$f":"IF(Inscripciones!AT$3=$B25,General!AT$41,\"\")","v":""},{"$f":"IF(Inscripciones!AU$3=$B25,General!AU$41,\"\")","v":""},{"$f":"IF(Inscripciones!AV$3=$B25,General!AV$41,\"\")","v":""},{"$f":"IF(Inscripciones!AW$3=$B25,General!AW$41,\"\")","v":""},{"$f":"IF(Inscripciones!AX$3=$B25,General!AX$41,\"\")","v":""},{"$f":"IF(Inscripciones!AY$3=$B25,General!AY$41,\"\")","v":""},{"$f":"IF(Inscripciones!AZ$3=$B25,General!AZ$41,\"\")","v":""},{"$f":"IF(Inscripciones!BA$3=$B25,General!BA$41,\"\")","v":""},{"$f":"IF(Inscripciones!BB$3=$B25,General!BB$41,\"\")","v":""},{"$f":"IF(Inscripciones!BC$3=$B25,General!BC$41,\"\")","v":""},{"$f":"IF(Inscripciones!BD$3=$B25,General!BD$41,\"\")","v":""},0]
["Noviembre","N",{"$f":"IF(Inscripciones!C$3=$B26,General!C$41,\"\")","v":""},{"$f":"IF(Inscripciones!D$3=$B26,General!D$41,\"\")","v":""},{"$f":"IF(Inscripciones!E$3=$B26,General!E$41,\"\")","v":""},{"$f":"IF(Inscripciones!F$3=$B26,General!F$41,\"\")","v":""},{"$f":"IF(Inscripciones!G$3=$B26,General!G$41,\"\")","v":""},{"$f":"IF(Inscripciones!H$3=$B26,General!H$41,\"\")","v":""},{"$f":"IF(Inscripciones!I$3=$B26,General!I$41,\"\")","v":""},{"$f":"IF(Inscripciones!J$3=$B26,General!J$41,\"\")","v":""},{"$f":"IF(Inscripciones!K$3=$B26,General!K$41,\"\")","v":""},{"$f":"IF(Inscripciones!L$3=$B26,General!L$41,\"\")","v":""},{"$f":"IF(Inscripciones!M$3=$B26,General!M$41,\"\")","v":""},{"$f":"IF(Inscripciones!N$3=$B26,General!N$41,\"\")","v":""},{"$f":"IF(Inscripciones!O$3=$B26,General!O$41,\"\")","v":""},{"$f":"IF(Inscripciones!P$3=$B26,General!P$41,\"\")","v":""},{"$f":"IF(Inscripciones!Q$3=$B26,General!Q$41,\"\")","v":""},{"$f":"IF(Inscripciones!R$3=$B26,General!R$41,\"\")","v":""},{"$f":"IF(Inscripciones!S$3=$B26,General!S$41,\"\")","v":""},{"$f":"IF(Inscripciones!T$3=$B26,General!T$41,\"\")","v":""},{"$f":"IF(Inscripciones!U$3=$B26,General!U$41,\"\")","v":""},{"$f":"IF(Inscripciones!V$3=$B26,General!V$41,\"\")","v":""},{"$f":"IF(Inscripciones!W$3=$B26,General!W$41,\"\")","v":""},{"$f":"IF(Inscripciones!X$3=$B26,General!X$41,\"\")","v":""},{"$f":"IF(Inscripciones!Y$3=$B26,General!Y$41,\"\")","v":""},{"$f":"IF(Inscripciones!Z$3=$B26,General!Z$41,\"\")","v":0},{"$f":"IF(Inscripciones!AA$3=$B26,General!AA$41,\"\")","v":0},{"$f":"IF(Inscripciones!AB$3=$B26,General!AB$41,\"\")","v":0},{"$f":"IF(Inscripciones!AC$3=$B26,General!AC$41,\"\")","v":0},{"$f":"IF(Inscripciones!AD$3=$B26,General!AD$41,\"\")","v":""},{"$f":"IF(Inscripciones!AE$3=$B26,General!AE$41,\"\")","v":""},{"$f":"IF(Inscripciones!AF$3=$B26,General!AF$41,\"\")","v":""},{"$f":"IF(Inscripciones!AG$3=$B26,General!AG$41,\"\")","v":""},{"$f":"IF(Inscripciones!AH$3=$B26,General!AH$41,\"\")","v":""},{"$f":"IF(Inscripciones!AI$3=$B26,General!AI$41,\"\")","v":""},{"$f":"IF(Inscripciones!AJ$3=$B26,General!AJ$41,\"\")","v":""},{"$f":"IF(Inscripciones!AK$3=$B26,General!AK$41,\"\")","v":""},{"$f":"IF(Inscripciones!AL$3=$B26,General!AL$41,\"\")","v":""},{"$f":"IF(Inscripciones!AM$3=$B26,General!AM$41,\"\")","v":""},{"$f":"IF(Inscripciones!AN$3=$B26,General!AN$41,\"\")","v":""},{"$f":"IF(Inscripciones!AO$3=$B26,General!AO$41,\"\")","v":""},{"$f":"IF(Inscripciones!AP$3=$B26,General!AP$41,\"\")","v":""},{"$f":"IF(Inscripciones!AQ$3=$B26,General!AQ$41,\"\")","v":""},{"$f":"IF(Inscripciones!AR$3=$B26,General!AR$41,\"\")","v":""},{"$f":"IF(Inscripciones!AS$3=$B26,General!AS$41,\"\")","v":""},{"$f":"IF(Inscripciones!AT$3=$B26,General!AT$41,\"\")","v":""},{"$f":"IF(Inscripciones!AU$3=$B26,General!AU$41,\"\")","v":""},{"$f":"IF(Inscripciones!AV$3=$B26,General!AV$41,\"\")","v":""},{"$f":"IF(Inscripciones!AW$3=$B26,General!AW$41,\"\")","v":""},{"$f":"IF(Inscripciones!AX$3=$B26,General!AX$41,\"\")","v":""},{"$f":"IF(Inscripciones!AY$3=$B26,General!AY$41,\"\")","v":""},{"$f":"IF(Inscripciones!AZ$3=$B26,General!AZ$41,\"\")","v":""},{"$f":"IF(Inscripciones!BA$3=$B26,General!BA$41,\"\")","v":""},{"$f":"IF(Inscripciones!BB$3=$B26,General!BB$41,\"\")","v":""},{"$f":"IF(Inscripciones!BC$3=$B26,General!BC$41,\"\")","v":""},{"$f":"IF(Inscripciones!BD$3=$B26,General!BD$41,\"\")","v":""},{"$f":"SUM(C26:BD26)","v":0}]
["Diciembre","D",{"$f":"IF(Inscripciones!C$3=$B27,General!C$41,\"\")","v":""},{"$f":"IF(Inscripciones!D$3=$B27,General!D$41,\"\")","v":""},{"$f":"IF(Inscripciones!E$3=$B27,General!E$41,\"\")","v":""},{"$f":"IF(Inscripciones!F$3=$B27,General!F$41,\"\")","v":""},{"$f":"IF(Inscripciones!G$3=$B27,General!G$41,\"\")","v":""},{"$f":"IF(Inscripciones!H$3=$B27,General!H$41,\"\")","v":""},{"$f":"IF(Inscripciones!I$3=$B27,General!I$41,\"\")","v":""},{"$f":"IF(Inscripciones!J$3=$B27,General!J$41,\"\")","v":""},{"$f":"IF(Inscripciones!K$3=$B27,General!K$41,\"\")","v":""},{"$f":"IF(Inscripciones!L$3=$B27,General!L$41,\"\")","v":""},{"$f":"IF(Inscripciones!M$3=$B27,General!M$41,\"\")","v":""},{"$f":"IF(Inscripciones!N$3=$B27,General!N$41,\"\")","v":""},{"$f":"IF(Inscripciones!O$3=$B27,General!O$41,\"\")","v":""},{"$f":"IF(Inscripciones!P$3=$B27,General!P$41,\"\")","v":""},{"$f":"IF(Inscripciones!Q$3=$B27,General!Q$41,\"\")","v":""},{"$f":"IF(Inscripciones!R$3=$B27,General!R$41,\"\")","v":""},{"$f":"IF(Inscripciones!S$3=$B27,General!S$41,\"\")","v":""},{"$f":"IF(Inscripciones!T$3=$B27,General!T$41,\"\")","v":""},{"$f":"IF(Inscripciones!U$3=$B27,General!U$41,\"\")","v":""},{"$f":"IF(Inscripciones!V$3=$B27,General!V$41,\"\")","v":""},{"$f":"IF(Inscripciones!W$3=$B27,General!W$41,\"\")","v":""},{"$f":"IF(Inscripciones!X$3=$B27,General!X$41,\"\")","v":""},{"$f":"IF(Inscripciones!Y$3=$B27,General!Y$41,\"\")","v":""},{"$f":"IF(Inscripciones!Z$3=$B27,General!Z$41,\"\")","v":""},{"$f":"IF(Inscripciones!AA$3=$B27,General!AA$41,\"\")","v":""},{"$f":"IF(Inscripciones!AB$3=$B27,General!AB$41,\"\")","v":""},{"$f":"IF(Inscripciones!AC$3=$B27,General!AC$41,\"\")","v":""},{"$f":"IF(Inscripciones!AD$3=$B27,General!AD$41,\"\")","v":""},{"$f":"IF(Inscripciones!AE$3=$B27,General!AE$41,\"\")","v":""},{"$f":"IF(Inscripciones!AF$3=$B27,General!AF$41,\"\")","v":""},{"$f":"IF(Inscripciones!AG$3=$B27,General!AG$41,\"\")","v":""},{"$f":"IF(Inscripciones!AH$3=$B27,General!AH$41,\"\")","v":""},{"$f":"IF(Inscripciones!AI$3=$B27,General!AI$41,\"\")","v":""},{"$f":"IF(Inscripciones!AJ$3=$B27,General!AJ$41,\"\")","v":""},{"$f":"IF(Inscripciones!AK$3=$B27,General!AK$41,\"\")","v":""},{"$f":"IF(Inscripciones!AL$3=$B27,General!AL$41,\"\")","v":""},{"$f":"IF(Inscripciones!AM$3=$B27,General!AM$41,\"\")","v":""},{"$f":"IF(Inscripciones!AN$3=$B27,General!AN$41,\"\")","v":""},{"$f":"IF(Inscripciones!AO$3=$B27,General!AO$41,\"\")","v":""},{"$f":"IF(Inscripciones!AP$3=$B27,General!AP$41,\"\")","v":""},{"$f":"IF(Inscripciones!AQ$3=$B27,General!AQ$41,\"\")","v":""},{"$f":"IF(Inscripciones!AR$3=$B27,General!AR$41,\"\")","v":""},{"$f":"IF(Inscripciones!AS$3=$B27,General!AS$41,\"\")","v":""},{"$f":"IF(Inscripciones!AT$3=$B27,General!AT$41,\"\")","v":""},{"$f":"IF(Inscripciones!AU$3=$B27,General!AU$41,\"\")","v":""},{"$f":"IF(Inscripciones!AV$3=$B27,General!AV$41,\"\")","v":""},{"$f":"IF(Inscripciones!AW$3=$B27,General!AW$41,\"\")","v":""},{"$f":"IF(Inscripciones!AX$3=$B27,General!AX$41,\"\")","v":""},{"$f":"IF(Inscripciones!AY$3=$B27,General!AY$41,\"\")","v":""},{"$f":"IF(Inscripciones!AZ$3=$B27,General!AZ$41,\"\")","v":""},{"$f":"IF(Inscripciones!BA$3=$B27,General!BA$41,\"\")","v":""},{"$f":"IF(Inscripciones!BB$3=$B27,General!BB$41,\"\")","v":""},{"$f":"IF(Inscripciones!BC$3=$B27,General!BC$41,\"\")","v":""},{"$f":"IF(Inscripciones!BD$3=$B27,General!BD$41,\"\")","v":""},{"$f":"SUM(C27:BD27)","v":0}]
[]
["Regularidad",null,1,2,3,4,5,6,7,8,9,10,11,12,13,14,15,16,17,18,19,20,21,22,23,24,25,26,27,28,29,30,31,32,33,34,35,36,37,38,39,40,41,42,43,44,45,46,47,48,49,50,51,52,53,54,"Total"]
["Enero","E",{"$f":"IF(Regularidad!C$4=GastosIngresos!$B30,Regularidad!C$41,\"\")","v":""},{"$f":"IF(Regularidad!D$4=GastosIngresos!$B30,Regularidad!D$41,\"\")","v":""},{"$f":"IF(Regularidad!E$4=GastosIngresos!$B30,Regularidad!E$41,\"\")","v":""},{"$f":"IF(Regularidad!F$4=GastosIngresos!$B30,Regularidad!F$41,\"\")","v":""},{"$f":"IF(Regularidad!G$4=GastosIngresos!$B30,Regularidad!G$41,\"\")","v":""},{"$f":"IF(Regularidad!H$4=GastosIngresos!$B30,Regularidad!H$41,\"\")","v":""},{"$f":"IF(Regularidad!I$4=GastosIngresos!$B30,Regularidad!I$41,\"\")","v":""},{"$f":"IF(Regularidad!J$4=GastosIngresos!$B30,Regularidad!J$41,\"\")","v":""},{"$f":"IF(Regularidad!K$4=GastosIngresos!$B30,Regularidad!K$41,\"\")","v":""},{"$f":"IF(Regularidad!L$4=GastosIngresos!$B30,Regularidad!L$41,\"\")","v":""},{"$f":"IF(Regularidad!M$4=GastosIngresos!$B30,Regularidad!M$41,\"\")","v":""},{"$f":"IF(Regularidad!N$4=GastosIngresos!$B30,Regularidad!N$41,\"\")","v":""},{"$f":"IF(Regularidad!O$4=GastosIngresos!$B30,Regularidad!O$41,\"\")","v":""},{"$f":"IF(Regularidad!P$4=GastosIngresos!$B30,Regularidad!P$41,\"\")","v":""},{"$f":"IF(Regularidad!Q$4=GastosIngresos!$B30,Regularidad!Q$41,\"\")","v":""},{"$f":"IF(Regularidad!R$4=GastosIngresos!$B30,Regularidad!R$41,\"\")","v":""},{"$f":"IF(Regularidad!S$4=GastosIngresos!$B30,Regularidad!S$41,\"\")","v":""},{"$f":"IF(Regularidad!T$4=GastosIngresos!$B30,Regularidad!T$41,\"\")","v":""},{"$f":"IF(Regularidad!U$4=GastosIngresos!$B30,Regularidad!U$41,\"\")","v":""},{"$f":"IF(Regularidad!V$4=GastosIngresos!$B30,Regularidad!V$41,\"\")","v":""},{"$f":"IF(Regularidad!W$4=GastosIngresos!$B30,Regularidad!W$41,\"\")","v":""},{"$f":"IF(Regularidad!X$4=GastosIngresos!$B30,Regularidad!X$41,\"\")","v":""},{"$f":"IF(Regularidad!Y$4=GastosIngresos!$B30,Regularidad!Y$41,\"\")","v":""},{"$f":"IF(Regularidad!Z$4=GastosIngresos!$B30,Regularidad!Z$41,\"\")","v":""},null,null,null,{"$f":"IF(Regularidad!AD$4=GastosIngresos!$B30,Regularidad!AD$41,\"\")","v":""},{"$f":"IF(Regularidad!AE$4=GastosIngresos!$B30,Regularidad!AE$41,\"\")","v":""},{"$f":"IF(Regularidad!AF$4=GastosIngresos!$B30,Regularidad!AF$41,\"\")","v":""},{"$f":"IF(Regularidad!AG$4=GastosIngresos!$B30,Regularidad!AG$41,\"\")","v":""},{"$f":"IF(Regularidad!AH$4=GastosIngresos!$B30,Regularidad!AH$41,\"\")","v":""},{"$f":"IF(Regularidad!AI$4=GastosIngresos!$B30,Regularidad!AI$41,\"\")","v":""},{"$f":"IF(Regularidad!AJ$4=GastosIngresos!$B30,Regularidad!AJ$41,\"\")","v":""},{"$f":"IF(Regularidad!AK$4=GastosIngresos!$B30,Regularidad!AK$41,\"\")","v":""},{"$f":"IF(Regularidad!AL$4=GastosIngresos!$B30,Regularidad!AL$41,\"\")","v":""},{"$f":"IF(Regularidad!AM$4=GastosIngresos!$B30,Regularidad!AM$41,\"\")","v":""},{"$f":"IF(Regularidad!AN$4=GastosIngresos!$B30,Regularidad!AN$41,\"\")","v":""},{"$f":"IF(Regularidad!AO$4=GastosIngresos!$B30,Regularidad!AO$41,\"\")","v":""},{"$f":"IF(Regularidad!AP$4=GastosIngresos!$B30,Regularidad!AP$41,\"\")","v":""},{"$f":"IF(Regularidad!AQ$4=GastosIngresos!$B30,Regularidad!AQ$41,\"\")","v":""},{"$f":"IF(Regularidad!AR$4=GastosIngresos!$B30,Regularidad!AR$41,\"\")","v":""},{"$f":"IF(Regularidad!AS$4=GastosIngresos!$B30,Regularidad!AS$41,\"\")","v":""},{"$f":"IF(Regularidad!AT$4=GastosIngresos!$B30,Regularidad!AT$41,\"\")","v":""},{"$f":"IF(Regularidad!AU$4=GastosIngresos!$B30,Regularidad!AU$41,\"\")","v":""},{"$f":"IF(Regularidad!AV$4=GastosIngresos!$B30,Regularidad!AV$41,\"\")","v":""},{"$f":"IF(Regularidad!AW$4=GastosIngresos!$B30,Regularidad!AW$41,\"\")","v":""},{"$f":"IF(Regularidad!AX$4=GastosIngresos!$B30,Regularidad!AX$41,\"\")","v":""},{"$f":"IF(Regularidad!AY$4=GastosIngresos!$B30,Regularidad!AY$41,\"\")","v":""},{"$f":"IF(Regularidad!AZ$4=GastosIngresos!$B30,Regularidad!AZ$41,\"\")","v":""},{"$f":"IF(Regularidad!BA$4=GastosIngresos!$B30,Regularidad!BA$41,\"\")","v":""},{"$f":"IF(Regularidad!BB$4=GastosIngresos!$B30,Regularidad!BB$41,\"\")","v":""},{"$f":"IF(Regularidad!BC$4=GastosIngresos!$B30,Regularidad!BC$41,\"\")","v":""},{"$f":"IF(Regularidad!BD$4=GastosIngresos!$B30,Regularidad!BD$41,\"\")","v":""},{"$f":"SUM(C30:BD30)","v":0}]
["Febrero","F",{"$f":"IF(Regularidad!C$4=GastosIngresos!$B31,Regularidad!C$41,\"\")","v":""},{"$f":"IF(Regularidad!D$4=GastosIngresos!$B31,Regularidad!D$41,\"\")","v":""},{"$f":"IF(Regularidad!E$4=GastosIngresos!$B31,Regularidad!E$41,\"\")","v":""},{"$f":"IF(Regularidad!F$4=GastosIngresos!$B31,Regularidad!F$41,\"\")","v":""},{"$f":"IF(Regularidad!G$4=GastosIngresos!$B31,Regularidad!G$41,\"\")","v":""},{"$f":"IF(Regularidad!H$4=GastosIngresos!$B31,Regularidad!H$41,\"\")","v":""},{"$f":"IF(Regularidad!I$4=GastosIngresos!$B31,Regularidad!I$41,\"\")","v":""},{"$f":"IF(Regularidad!J$4=GastosIngresos!$B31,Regularidad!J$41,\"\")","v":""},{"$f":"IF(Regularidad!K$4=GastosIngresos!$B31,Regularidad!K$41,\"\")","v":""},{"$f":"IF(Regularidad!L$4=GastosIngresos!$B31,Regularidad!L$41,\"\")","v":""},{"$f":"IF(Regularidad!M$4=GastosIngresos!$B31,Regularidad!M$41,\"\")","v":""},{"$f":"IF(Regularidad!N$4=GastosIngresos!$B31,Regularidad!N$41,\"\")","v":""},{"$f":"IF(Regularidad!O$4=GastosIngresos!$B31,Regularidad!O$41,\"\")","v":""},{"$f":"IF(Regularidad!P$4=GastosIngresos!$B31,Regularidad!P$41,\"\")","v":""},{"$f":"IF(Regularidad!Q$4=GastosIngresos!$B31,Regularidad!Q$41,\"\")","v":""},{"$f":"IF(Regularidad!R$4=GastosIngresos!$B31,Regularidad!R$41,\"\")","v":""},{"$f":"IF(Regularidad!S$4=GastosIngresos!$B31,Regularidad!S$41,\"\")","v":""},{"$f":"IF(Regularidad!T$4=GastosIngresos!$B31,Regularidad!T$41,\"\")","v":""},{"$f":"IF(Regularidad!U$4=GastosIngresos!$B31,Regularidad!U$41,\"\")","v":""},{"$f":"IF(Regularidad!V$4=GastosIngresos!$B31,Regularidad!V$41,\"\")","v":""},{"$f":"IF(Regularidad!W$4=GastosIngresos!$B31,Regularidad!W$41,\"\")","v":""},{"$f":"IF(Regularidad!X$4=GastosIngresos!$B31,Regularidad!X$41,\"\")","v":""},{"$f":"IF(Regularidad!Y$4=GastosIngresos!$B31,Regularidad!Y$41,\"\")","v":""},{"$f":"IF(Regularidad!Z$4=GastosIngresos!$B31,Regularidad!Z$41,\"\")","v":""},null,null,null,{"$f":"IF(Regularidad!AD$4=GastosIngresos!$B31,Regularidad!AD$41,\"\")","v":""},{"$f":"IF(Regularidad!AE$4=GastosIngresos!$B31,Regularidad!AE$41,\"\")","v":""},{"$f":"IF(Regularidad!AF$4=GastosIngresos!$B31,Regularidad!AF$41,\"\")","v":""},{"$f":"IF(Regularidad!AG$4=GastosIngresos!$B31,Regularidad!AG$41,\"\")","v":""},{"$f":"IF(Regularidad!AH$4=GastosIngresos!$B31,Regularidad!AH$41,\"\")","v":""},{"$f":"IF(Regularidad!AI$4=GastosIngresos!$B31,Regularidad!AI$41,\"\")","v":""},{"$f":"IF(Regularidad!AJ$4=GastosIngresos!$B31,Regularidad!AJ$41,\"\")","v":""},{"$f":"IF(Regularidad!AK$4=GastosIngresos!$B31,Regularidad!AK$41,\"\")","v":""},{"$f":"IF(Regularidad!AL$4=GastosIngresos!$B31,Regularidad!AL$41,\"\")","v":""},{"$f":"IF(Regularidad!AM$4=GastosIngresos!$B31,Regularidad!AM$41,\"\")","v":""},{"$f":"IF(Regularidad!AN$4=GastosIngresos!$B31,Regularidad!AN$41,\"\")","v":""},{"$f":"IF(Regularidad!AO$4=GastosIngresos!$B31,Regularidad!AO$41,\"\")","v":""},{"$f":"IF(Regularidad!AP$4=GastosIngresos!$B31,Regularidad!AP$41,\"\")","v":""},{"$f":"IF(Regularidad!AQ$4=GastosIngresos!$B31,Regularidad!AQ$41,\"\")","v":""},{"$f":"IF(Regularidad!AR$4=GastosIngresos!$B31,Regularidad!AR$41,\"\")","v":""},{"$f":"IF(Regularidad!AS$4=GastosIngresos!$B31,Regularidad!AS$41,\"\")","v":""},{"$f":"IF(Regularidad!AT$4=GastosIngresos!$B31,Regularidad!AT$41,\"\")","v":""},{"$f":"IF(Regularidad!AU$4=GastosIngresos!$B31,Regularidad!AU$41,\"\")","v":""},{"$f":"IF(Regularidad!AV$4=GastosIngresos!$B31,Regularidad!AV$41,\"\")","v":""},{"$f":"IF(Regularidad!AW$4=GastosIngresos!$B31,Regularidad!AW$41,\"\")","v":""},{"$f":"IF(Regularidad!AX$4=GastosIngresos!$B31,Regularidad!AX$41,\"\")","v":""},{"$f":"IF(Regularidad!AY$4=GastosIngresos!$B31,Regularidad!AY$41,\"\")","v":""},{"$f":"IF(Regularidad!AZ$4=GastosIngresos!$B31,Regularidad!AZ$41,\"\")","v":""},{"$f":"IF(Regularidad!BA$4=GastosIngresos!$B31,Regularidad!BA$41,\"\")","v":""},{"$f":"IF(Regularidad!BB$4=GastosIngresos!$B31,Regularidad!BB$41,\"\")","v":""},{"$f":"IF(Regularidad!BC$4=GastosIngresos!$B31,Regularidad!BC$41,\"\")","v":""},{"$f":"IF(Regularidad!BD$4=GastosIngresos!$B31,Regularidad!BD$41,\"\")","v":""},{"$f":"SUM(C31:BD31)","v":0}]
["Marzo","M",{"$f":"IF(Regularidad!C$4=GastosIngresos!$B32,Regularidad!C$41,\"\")","v":""},{"$f":"IF(Regularidad!D$4=GastosIngresos!$B32,Regularidad!D$41,\"\")","v":""},{"$f":"IF(Regularidad!E$4=GastosIngresos!$B32,Regularidad!E$41,\"\")","v":""},{"$f":"IF(Regularidad!F$4=GastosIngresos!$B32,Regularidad!F$41,\"\")","v":""},{"$f":"IF(Regularidad!G$4=GastosIngresos!$B32,Regularidad!G$41,\"\")","v":""},{"$f":"IF(Regularidad!H$4=GastosIngresos!$B32,Regularidad!H$41,\"\")","v":""},{"$f":"IF(Regularidad!I$4=GastosIngresos!$B32,Regularidad!I$41,\"\")","v":""},{"$f":"IF(Regularidad!J$4=GastosIngresos!$B32,Regularidad!J$41,\"\")","v":""},{"$f":"IF(Regularidad!K$4=GastosIngresos!$B32,Regularidad!K$41,\"\")","v":""},{"$f":"IF(Regularidad!L$4=GastosIngresos!$B32,Regularidad!L$41,\"\")","v":""},{"$f":"IF(Regularidad!M$4=GastosIngresos!$B32,Regularidad!M$41,\"\")","v":""},{"$f":"IF(Regularidad!N$4=GastosIngresos!$B32,Regularidad!N$41,\"\")","v":""},{"$f":"IF(Regularidad!O$4=GastosIngresos!$B32,Regularidad!O$41,\"\")","v":""},{"$f":"IF(Regularidad!P$4=GastosIngresos!$B32,Regularidad!P$41,\"\")","v":""},{"$f":"IF(Regularidad!Q$4=GastosIngresos!$B32,Regularidad!Q$41,\"\")","v":""},{"$f":"IF(Regularidad!R$4=GastosIngresos!$B32,Regularidad!R$41,\"\")","v":""},{"$f":"IF(Regularidad!S$4=GastosIngresos!$B32,Regularidad!S$41,\"\")","v":""},{"$f":"IF(Regularidad!T$4=GastosIngresos!$B32,Regularidad!T$41,\"\")","v":""},{"$f":"IF(Regularidad!U$4=GastosIngresos!$B32,Regularidad!U$41,\"\")","v":""},{"$f":"IF(Regularidad!V$4=GastosIngresos!$B32,Regularidad!V$41,\"\")","v":""},{"$f":"IF(Regularidad!W$4=GastosIngresos!$B32,Regularidad!W$41,\"\")","v":""},{"$f":"IF(Regularidad!X$4=GastosIngresos!$B32,Regularidad!X$41,\"\")","v":""},{"$f":"IF(Regularidad!Y$4=GastosIngresos!$B32,Regularidad!Y$41,\"\")","v":""},{"$f":"IF(Regularidad!Z$4=GastosIngresos!$B32,Regularidad!Z$41,\"\")","v":""},null,null,null,{"$f":"IF(Regularidad!AD$4=GastosIngresos!$B32,Regularidad!AD$41,\"\")","v":""},{"$f":"IF(Regularidad!AE$4=GastosIngresos!$B32,Regularidad!AE$41,\"\")","v":""},{"$f":"IF(Regularidad!AF$4=GastosIngresos!$B32,Regularidad!AF$41,\"\")","v":""},{"$f":"IF(Regularidad!AG$4=GastosIngresos!$B32,Regularidad!AG$41,\"\")","v":""},{"$f":"IF(Regularidad!AH$4=GastosIngresos!$B32,Regularidad!AH$41,\"\")","v":""},{"$f":"IF(Regularidad!AI$4=GastosIngresos!$B32,Regularidad!AI$41,\"\")","v":""},{"$f":"IF(Regularidad!AJ$4=GastosIngresos!$B32,Regularidad!AJ$41,\"\")","v":""},{"$f":"IF(Regularidad!AK$4=GastosIngresos!$B32,Regularidad!AK$41,\"\")","v":""},{"$f":"IF(Regularidad!AL$4=GastosIngresos!$B32,Regularidad!AL$41,\"\")","v":""},{"$f":"IF(Regularidad!AM$4=GastosIngresos!$B32,Regularidad!AM$41,\"\")","v":""},{"$f":"IF(Regularidad!AN$4=GastosIngresos!$B32,Regularidad!AN$41,\"\")","v":""},{"$f":"IF(Regularidad!AO$4=GastosIngresos!$B32,Regularidad!AO$41,\"\")","v":""},{"$f":"IF(Regularidad!AP$4=GastosIngresos!$B32,Regularidad!AP$41,\"\")","v":""},{"$f":"IF(Regularidad!AQ$4=GastosIngresos!$B32,Regularidad!AQ$41,\"\")","v":""},{"$f":"IF(Regularidad!AR$4=GastosIngresos!$B32,Regularidad!AR$41,\"\")","v":""},{"$f":"IF(Regularidad!AS$4=GastosIngresos!$B32,Regularidad!AS$41,\"\")","v":""},{"$f":"IF(Regularidad!AT$4=GastosIngresos!$B32,Regularidad!AT$41,\"\")","v":""},{"$f":"IF(Regularidad!AU$4=GastosIngresos!$B32,Regularidad!AU$41,\"\")","v":""},{"$f":"IF(Regularidad!AV$4=GastosIngresos!$B32,Regularidad!AV$41,\"\")","v":""},{"$f":"IF(Regularidad!AW$4=GastosIngresos!$B32,Regularidad!AW$41,\"\")","v":""},{"$f":"IF(Regularidad!AX$4=GastosIngresos!$B32,Regularidad!AX$41,\"\")","v":""},{"$f":"IF(Regularidad!AY$4=GastosIngresos!$B32,Regularidad!AY$41,\"\")","v":""},{"$f":"IF(Regularidad!AZ$4=GastosIngresos!$B32,Regularidad!AZ$41,\"\")","v":""},{"$f":"IF(Regularidad!BA$4=GastosIngresos!$B32,Regularidad!BA$41,\"\")","v":""},{"$f":"IF(Regularidad!BB$4=GastosIngresos!$B32,Regularidad!BB$41,\"\")","v":""},{"$f":"IF(Regularidad!BC$4=GastosIngresos!$B32,Regularidad!BC$41,\"\")","v":""},{"$f":"IF(Regularidad!BD$4=GastosIngresos!$B32,Regularidad!BD$41,\"\")","v":""},0]
["Abril","A",{"$f":"IF(Regularidad!C$4=GastosIngresos!$B33,Regularidad!C$41,\"\")","v":""},{"$f":"IF(Regularidad!D$4=GastosIngresos!$B33,Regularidad!D$41,\"\")","v":""},{"$f":"IF(Regularidad!E$4=GastosIngresos!$B33,Regularidad!E$41,\"\")","v":""},{"$f":"IF(Regularidad!F$4=GastosIngresos!$B33,Regularidad!F$41,\"\")","v":""},{"$f":"IF(Regularidad!G$4=GastosIngresos!$B33,Regularidad!G$41,\"\")","v":""},{"$f":"IF(Regularidad!H$4=GastosIngresos!$B33,Regularidad!H$41,\"\")","v":""},{"$f":"IF(Regularidad!I$4=GastosIngresos!$B33,Regularidad!I$41,\"\")","v":""},{"$f":"IF(Regularidad!J$4=GastosIngresos!$B33,Regularidad!J$41,\"\")","v":""},{"$f":"IF(Regularidad!K$4=GastosIngresos!$B33,Regularidad!K$41,\"\")","v":""},{"$f":"IF(Regularidad!L$4=GastosIngresos!$B33,Regularidad!L$41,\"\")","v":""},{"$f":"IF(Regularidad!M$4=GastosIngresos!$B33,Regularidad!M$41,\"\")","v":""},{"$f":"IF(Regularidad!N$4=GastosIngresos!$B33,Regularidad!N$41,\"\")","v":""},{"$f":"IF(Regularidad!O$4=GastosIngresos!$B33,Regularidad!O$41,\"\")","v":""},{"$f":"IF(Regularidad!P$4=GastosIngresos!$B33,Regularidad!P$41,\"\")","v":""},{"$f":"IF(Regularidad!Q$4=GastosIngresos!$B33,Regularidad!Q$41,\"\")","v":""},{"$f":"IF(Regularidad!R$4=GastosIngresos!$B33,Regularidad!R$41,\"\")","v":""},{"$f":"IF(Regularidad!S$4=GastosIngresos!$B33,Regularidad!S$41,\"\")","v":""},{"$f":"IF(Regularidad!T$4=GastosIngresos!$B33,Regularidad!T$41,\"\")","v":""},{"$f":"IF(Regularidad!U$4=GastosIngresos!$B33,Regularidad!U$41,\"\")","v":""},{"$f":"IF(Regularidad!V$4=GastosIngresos!$B33,Regularidad!V$41,\"\")","v":""},{"$f":"IF(Regularidad!W$4=GastosIngresos!$B33,Regularidad!W$41,\"\")","v":""},{"$f":"IF(Regularidad!X$4=GastosIngresos!$B33,Regularidad!X$41,\"\")","v":""},{"$f":"IF(Regularidad!Y$4=GastosIngresos!$B33,Regularidad!Y$41,\"\")","v":""},{"$f":"IF(Regularidad!Z$4=GastosIngresos!$B33,Regularidad!Z$41,\"\")","v":""},null,null,null,{"$f":"IF(Regularidad!AD$4=GastosIngresos!$B33,Regularidad!AD$41,\"\")","v":""},{"$f":"IF(Regularidad!AE$4=GastosIngresos!$B33,Regularidad!AE$41,\"\")","v":""},{"$f":"IF(Regularidad!AF$4=GastosIngresos!$B33,Regularidad!AF$41,\"\")","v":""},{"$f":"IF(Regularidad!AG$4=GastosIngresos!$B33,Regularidad!AG$41,\"\")","v":""},{"$f":"IF(Regularidad!AH$4=GastosIngresos!$B33,Regularidad!AH$41,\"\")","v":""},{"$f":"IF(Regularidad!AI$4=GastosIngresos!$B33,Regularidad!AI$41,\"\")","v":""},{"$f":"IF(Regularidad!AJ$4=GastosIngresos!$B33,Regularidad!AJ$41,\"\")","v":""},{"$f":"IF(Regularidad!AK$4=GastosIngresos!$B33,Regularidad!AK$41,\"\")","v":""},{"$f":"IF(Regularidad!AL$4=GastosIngresos!$B33,Regularidad!AL$41,\"\")","v":""},{"$f":"IF(Regularidad!AM$4=GastosIngresos!$B33,Regularidad!AM$41,\"\")","v":""},{"$f":"IF(Regularidad!AN$4=GastosIngresos!$B33,Regularidad!AN$41,\"\")","v":""},{"$f":"IF(Regularidad!AO$4=GastosIngresos!$B33,Regularidad!AO$41,\"\")","v":""},{"$f":"IF(Regularidad!AP$4=GastosIngresos!$B33,Regularidad!AP$41,\"\")","v":""},{"$f":"IF(Regularidad!AQ$4=GastosIngresos!$B33,Regularidad!AQ$41,\"\")","v":""},{"$f":"IF(Regularidad!AR$4=GastosIngresos!$B33,Regularidad!AR$41,\"\")","v":""},{"$f":"IF(Regularidad!AS$4=GastosIngresos!$B33,Regularidad!AS$41,\"\")","v":""},{"$f":"IF(Regularidad!AT$4=GastosIngresos!$B33,Regularidad!AT$41,\"\")","v":""},{"$f":"IF(Regularidad!AU$4=GastosIngresos!$B33,Regularidad!AU$41,\"\")","v":""},{"$f":"IF(Regularidad!AV$4=GastosIngresos!$B33,Regularidad!AV$41,\"\")","v":""},{"$f":"IF(Regularidad!AW$4=GastosIngresos!$B33,Regularidad!AW$41,\"\")","v":""},{"$f":"IF(Regularidad!AX$4=GastosIngresos!$B33,Regularidad!AX$41,\"\")","v":""},{"$f":"IF(Regularidad!AY$4=GastosIngresos!$B33,Regularidad!AY$41,\"\")","v":""},{"$f":"IF(Regularidad!AZ$4=GastosIngresos!$B33,Regularidad!AZ$41,\"\")","v":""},{"$f":"IF(Regularidad!BA$4=GastosIngresos!$B33,Regularidad!BA$41,\"\")","v":""},{"$f":"IF(Regularidad!BB$4=GastosIngresos!$B33,Regularidad!BB$41,\"\")","v":""},{"$f":"IF(Regularidad!BC$4=GastosIngresos!$B33,Regularidad!BC$41,\"\")","v":""},{"$f":"IF(Regularidad!BD$4=GastosIngresos!$B33,Regularidad!BD$41,\"\")","v":""},0]
["Mayo","My",{"$f":"IF(Regularidad!C$4=GastosIngresos!$B34,Regularidad!C$41,\"\")","v":""},{"$f":"IF(Regularidad!D$4=GastosIngresos!$B34,Regularidad!D$41,\"\")","v":""},{"$f":"IF(Regularidad!E$4=GastosIngresos!$B34,Regularidad!E$41,\"\")","v":""},{"$f":"IF(Regularidad!F$4=GastosIngresos!$B34,Regularidad!F$41,\"\")","v":""},{"$f":"IF(Regularidad!G$4=GastosIngresos!$B34,Regularidad!G$41,\"\")","v":""},{"$f":"IF(Regularidad!H$4=GastosIngresos!$B34,Regularidad!H$41,\"\")","v":""},{"$f":"IF(Regularidad!I$4=GastosIngresos!$B34,Regularidad!I$41,\"\")","v":""},{"$f":"IF(Regularidad!J$4=GastosIngresos!$B34,Regularidad!J$41,\"\")","v":""},{"$f":"IF(Regularidad!K$4=GastosIngresos!$B34,Regularidad!K$41,\"\")","v":""},{"$f":"IF(Regularidad!L$4=GastosIngresos!$B34,Regularidad!L$41,\"\")","v":""},{"$f":"IF(Regularidad!M$4=GastosIngresos!$B34,Regularidad!M$41,\"\")","v":""},{"$f":"IF(Regularidad!N$4=GastosIngresos!$B34,Regularidad!N$41,\"\")","v":""},{"$f":"IF(Regularidad!O$4=GastosIngresos!$B34,Regularidad!O$41,\"\")","v":""},{"$f":"IF(Regularidad!P$4=GastosIngresos!$B34,Regularidad!P$41,\"\")","v":""},{"$f":"IF(Regularidad!Q$4=GastosIngresos!$B34,Regularidad!Q$41,\"\")","v":""},{"$f":"IF(Regularidad!R$4=GastosIngresos!$B34,Regularidad!R$41,\"\")","v":""},{"$f":"IF(Regularidad!S$4=GastosIngresos!$B34,Regularidad!S$41,\"\")","v":""},{"$f":"IF(Regularidad!T$4=GastosIngresos!$B34,Regularidad!T$41,\"\")","v":""},{"$f":"IF(Regularidad!U$4=GastosIngresos!$B34,Regularidad!U$41,\"\")","v":""},{"$f":"IF(Regularidad!V$4=GastosIngresos!$B34,Regularidad!V$41,\"\")","v":""},{"$f":"IF(Regularidad!W$4=GastosIngresos!$B34,Regularidad!W$41,\"\")","v":""},{"$f":"IF(Regularidad!X$4=GastosIngresos!$B34,Regularidad!X$41,\"\")","v":""},{"$f":"IF(Regularidad!Y$4=GastosIngresos!$B34,Regularidad!Y$41,\"\")","v":""},{"$f":"IF(Regularidad!Z$4=GastosIngresos!$B34,Regularidad!Z$41,\"\")","v":""},null,null,null,{"$f":"IF(Regularidad!AD$4=GastosIngresos!$B34,Regularidad!AD$41,\"\")","v":""},{"$f":"IF(Regularidad!AE$4=GastosIngresos!$B34,Regularidad!AE$41,\"\")","v":0},{"$f":"IF(Regularidad!AF$4=GastosIngresos!$B34,Regularidad!AF$41,\"\")","v":0},{"$f":"IF(Regularidad!AG$4=GastosIngresos!$B34,Regularidad!AG$41,\"\")","v":0},{"$f":"IF(Regularidad!AH$4=GastosIngresos!$B34,Regularidad!AH$41,\"\")","v":0},{"$f":"IF(Regularidad!AI$4=GastosIngresos!$B34,Regularidad!AI$41,\"\")","v":0},{"$f":"IF(Regularidad!AJ$4=GastosIngresos!$B34,Regularidad!AJ$41,\"\")","v":0},{"$f":"IF(Regularidad!AK$4=GastosIngresos!$B34,Regularidad!AK$41,\"\")","v":0},{"$f":"IF(Regularidad!AL$4=GastosIngresos!$B34,Regularidad!AL$41,\"\")","v":0},{"$f":"IF(Regularidad!AM$4=GastosIngresos!$B34,Regularidad!AM$41,\"\")","v":0},{"$f":"IF(Regularidad!AN$4=GastosIngresos!$B34,Regularidad!AN$41,\"\")","v":0},{"$f":"IF(Regularidad!AO$4=GastosIngresos!$B34,Regularidad!AO$41,\"\")","v":0},{"$f":"IF(Regularidad!AP$4=GastosIngresos!$B34,Regularidad!AP$41,\"\")","v":0},{"$f":"IF(Regularidad!AQ$4=GastosIngresos!$B34,Regularidad!AQ$41,\"\")","v":0},{"$f":"IF(Regularidad!AR$4=GastosIngresos!$B34,Regularidad!AR$41,\"\")","v":0},{"$f":"IF(Regularidad!AS$4=GastosIngresos!$B34,Regularidad!AS$41,\"\")","v":0},{"$f":"IF(Regularidad!AT$4=GastosIngresos!$B34,Regularidad!AT$41,\"\")","v":0},{"$f":"IF(Regularidad!AU$4=GastosIngresos!$B34,Regularidad!AU$41,\"\")","v":""},{"$f":"IF(Regularidad!AV$4=GastosIngresos!$B34,Regularidad!AV$41,\"\")","v":""},{"$f":"IF(Regularidad!AW$4=GastosIngresos!$B34,Regularidad!AW$41,\"\")","v":""},{"$f":"IF(Regularidad!AX$4=GastosIngresos!$B34,Regularidad!AX$41,\"\")","v":""},{"$f":"IF(Regularidad!AY$4=GastosIngresos!$B34,Regularidad!AY$41,\"\")","v":""},{"$f":"IF(Regularidad!AZ$4=GastosIngresos!$B34,Regularidad!AZ$41,\"\")","v":""},{"$f":"IF(Regularidad!BA$4=GastosIngresos!$B34,Regularidad!BA$41,\"\")","v":""},{"$f":"IF(Regularidad!BB$4=GastosIngresos!$B34,Regularidad!BB$41,\"\")","v":""},{"$f":"IF(Regularidad!BC$4=GastosIngresos!$B34,Regularidad!BC$41,\"\")","v":""},{"$f":"IF(Regularidad!BD$4=GastosIngresos!$B34,Regularidad!BD$41,\"\")","v":""},0]
["Junio","J",{"$f":"IF(Regularidad!C$4=GastosIngresos!$B35,Regularidad!C$41,\"\")","v":""},{"$f":"IF(Regularidad!D$4=GastosIngresos!$B35,Regularidad!D$41,\"\")","v":""},{"$f":"IF(Regularidad!E$4=GastosIngresos!$B35,Regularidad!E$41,\"\")","v":""},{"$f":"IF(Regularidad!F$4=GastosIngresos!$B35,Regularidad!F$41,\"\")","v":""},{"$f":"IF(Regularidad!G$4=GastosIngresos!$B35,Regularidad!G$41,\"\")","v":""},{"$f":"IF(Regularidad!H$4=GastosIngresos!$B35,Regularidad!H$41,\"\")","v":""},{"$f":"IF(Regularidad!I$4=GastosIngresos!$B35,Regularidad!I$41,\"\")","v":""},{"$f":"IF(Regularidad!J$4=GastosIngresos!$B35,Regularidad!J$41,\"\")","v":""},{"$f":"IF(Regularidad!K$4=GastosIngresos!$B35,Regularidad!K$41,\"\")","v":""},{"$f":"IF(Regularidad!L$4=GastosIngresos!$B35,Regularidad!L$41,\"\")","v":""},{"$f":"IF(Regularidad!M$4=GastosIngresos!$B35,Regularidad!M$41,\"\")","v":""},{"$f":"IF(Regularidad!N$4=GastosIngresos!$B35,Regularidad!N$41,\"\")","v":""},{"$f":"IF(Regularidad!O$4=GastosIngresos!$B35,Regularidad!O$41,\"\")","v":""},{"$f":"IF(Regularidad!P$4=GastosIngresos!$B35,Regularidad!P$41,\"\")","v":""},{"$f":"IF(Regularidad!Q$4=GastosIngresos!$B35,Regularidad!Q$41,\"\")","v":""},{"$f":"IF(Regularidad!R$4=GastosIngresos!$B35,Regularidad!R$41,\"\")","v":""},{"$f":"IF(Regularidad!S$4=GastosIngresos!$B35,Regularidad!S$41,\"\")","v":""},{"$f":"IF(Regularidad!T$4=GastosIngresos!$B35,Regularidad!T$41,\"\")","v":""},{"$f":"IF(Regularidad!U$4=GastosIngresos!$B35,Regularidad!U$41,\"\")","v":""},{"$f":"IF(Regularidad!V$4=GastosIngresos!$B35,Regularidad!V$41,\"\")","v":""},{"$f":"IF(Regularidad!W$4=GastosIngresos!$B35,Regularidad!W$41,\"\")","v":""},{"$f":"IF(Regularidad!X$4=GastosIngresos!$B35,Regularidad!X$41,\"\")","v":""},{"$f":"IF(Regularidad!Y$4=GastosIngresos!$B35,Regularidad!Y$41,\"\")","v":""},{"$f":"IF(Regularidad!Z$4=GastosIngresos!$B35,Regularidad!Z$41,\"\")","v":""},null,null,null,{"$f":"IF(Regularidad!AD$4=GastosIngresos!$B35,Regularidad!AD$41,\"\")","v":""},{"$f":"IF(Regularidad!AE$4=GastosIngresos!$B35,Regularidad!AE$41,\"\")","v":""},{"$f":"IF(Regularidad!AF$4=GastosIngresos!$B35,Regularidad!AF$41,\"\")","v":""},{"$f":"IF(Regularidad!AG$4=GastosIngresos!$B35,Regularidad!AG$41,\"\")","v":""},{"$f":"IF(Regularidad!AH$4=GastosIngresos!$B35,Regularidad!AH$41,\"\")","v":""},{"$f":"IF(Regularidad!AI$4=GastosIngresos!$B35,Regularidad!AI$41,\"\")","v":""},{"$f":"IF(Regularidad!AJ$4=GastosIngresos!$B35,Regularidad!AJ$41,\"\")","v":""},{"$f":"IF(Regularidad!AK$4=GastosIngresos!$B35,Regularidad!AK$41,\"\")","v":""},{"$f":"IF(Regularidad!AL$4=GastosIngresos!$B35,Regularidad!AL$41,\"\")","v":""},{"$f":"IF(Regularidad!AM$4=GastosIngresos!$B35,Regularidad!AM$41,\"\")","v":""},{"$f":"IF(Regularidad!AN$4=GastosIngresos!$B35,Regularidad!AN$41,\"\")","v":""},{"$f":"IF(Regularidad!AO$4=GastosIngresos!$B35,Regularidad!AO$41,\"\")","v":""},{"$f":"IF(Regularidad!AP$4=GastosIngresos!$B35,Regularidad!AP$41,\"\")","v":""},{"$f":"IF(Regularidad!AQ$4=GastosIngresos!$B35,Regularidad!AQ$41,\"\")","v":""},{"$f":"IF(Regularidad!AR$4=GastosIngresos!$B35,Regularidad!AR$41,\"\")","v":""},{"$f":"IF(Regularidad!AS$4=GastosIngresos!$B35,Regularidad!AS$41,\"\")","v":""},{"$f":"IF(Regularidad!AT$4=GastosIngresos!$B35,Regularidad!AT$41,\"\")","v":""},{"$f":"IF(Regularidad!AU$4=GastosIngresos!$B35,Regularidad!AU$41,\"\")","v":0},{"$f":"IF(Regularidad!AV$4=GastosIngresos!$B35,Regularidad!AV$41,\"\")","v":0},{"$f":"IF(Regularidad!AW$4=GastosIngresos!$B35,Regularidad!AW$41,\"\")","v":0},{"$f":"IF(Regularidad!AX$4=GastosIngresos!$B35,Regularidad!AX$41,\"\")","v":0},{"$f":"IF(Regularidad!AY$4=GastosIngresos!$B35,Regularidad!AY$41,\"\")","v":0},{"$f":"IF(Regularidad!AZ$4=GastosIngresos!$B35,Regularidad!AZ$41,\"\")","v":0},{"$f":"IF(Regularidad!BA$4=GastosIngresos!$B35,Regularidad!BA$41,\"\")","v":0},{"$f":"IF(Regularidad!BB$4=GastosIngresos!$B35,Regularidad!BB$41,\"\")","v":0},{"$f":"IF(Regularidad!BC$4=GastosIngresos!$B35,Regularidad!BC$41,\"\")","v":0},{"$f":"IF(Regularidad!BD$4=GastosIngresos!$B35,Regularidad!BD$41,\"\")","v":""},0]
["Julio","Jl",{"$f":"IF(Regularidad!C$4=GastosIngresos!$B36,Regularidad!C$41,\"\")","v":""},{"$f":"IF(Regularidad!D$4=GastosIngresos!$B36,Regularidad!D$41,\"\")","v":""},{"$f":"IF(Regularidad!E$4=GastosIngresos!$B36,Regularidad!E$41,\"\")","v":""},{"$f":"IF(Regularidad!F$4=GastosIngresos!$B36,Regularidad!F$41,\"\")","v":""},{"$f":"IF(Regularidad!G$4=GastosIngresos!$B36,Regularidad!G$41,\"\")","v":""},{"$f":"IF(Regularidad!H$4=GastosIngresos!$B36,Regularidad!H$41,\"\")","v":""},{"$f":"IF(Regularidad!I$4=GastosIngresos!$B36,Regularidad!I$41,\"\")","v":""},{"$f":"IF(Regularidad!J$4=GastosIngresos!$B36,Regularidad!J$41,\"\")","v":""},{"$f":"IF(Regularidad!K$4=GastosIngresos!$B36,Regularidad!K$41,\"\")","v":""},{"$f":"IF(Regularidad!L$4=GastosIngresos!$B36,Regularidad!L$41,\"\")","v":""},{"$f":"IF(Regularidad!M$4=GastosIngresos!$B36,Regularidad!M$41,\"\")","v":""},{"$f":"IF(Regularidad!N$4=GastosIngresos!$B36,Regularidad!N$41,\"\")","v":""},{"$f":"IF(Regularidad!O$4=GastosIngresos!$B36,Regularidad!O$41,\"\")","v":""},{"$f":"IF(Regularidad!P$4=GastosIngresos!$B36,Regularidad!P$41,\"\")","v":""},{"$f":"IF(Regularidad!Q$4=GastosIngresos!$B36,Regularidad!Q$41,\"\")","v":""},{"$f":"IF(Regularidad!R$4=GastosIngresos!$B36,Regularidad!R$41,\"\")","v":""},{"$f":"IF(Regularidad!S$4=GastosIngresos!$B36,Regularidad!S$41,\"\")","v":""},{"$f":"IF(Regularidad!T$4=GastosIngresos!$B36,Regularidad!T$41,\"\")","v":""},{"$f":"IF(Regularidad!U$4=GastosIngresos!$B36,Regularidad!U$41,\"\")","v":""},{"$f":"IF(Regularidad!V$4=GastosIngresos!$B36,Regularidad!V$41,\"\")","v":""},{"$f":"IF(Regularidad!W$4=GastosIngresos!$B36,Regularidad!W$41,\"\")","v":""},{"$f":"IF(Regularidad!X$4=GastosIngresos!$B36,Regularidad!X$41,\"\")","v":""},{"$f":"IF(Regularidad!Y$4=GastosIngresos!$B36,Regularidad!Y$41,\"\")","v":""},{"$f":"IF(Regularidad!Z$4=GastosIngresos!$B36,Regularidad!Z$41,\"\")","v":""},null,null,null,{"$f":"IF(Regularidad!AD$4=GastosIngresos!$B36,Regularidad!AD$41,\"\")","v":""},{"$f":"IF(Regularidad!AE$4=GastosIngresos!$B36,Regularidad!AE$41,\"\")","v":""},{"$f":"IF(Regularidad!AF$4=GastosIngresos!$B36,Regularidad!AF$41,\"\")","v":""},{"$f":"IF(Regularidad!AG$4=GastosIngresos!$B36,Regularidad!AG$41,\"\")","v":""},{"$f":"IF(Regularidad!AH$4=GastosIngresos!$B36,Regularidad!AH$41,\"\")","v":""},{"$f":"IF(Regularidad!AI$4=GastosIngresos!$B36,Regularidad!AI$41,\"\")","v":""},{"$f":"IF(Regularidad!AJ$4=GastosIngresos!$B36,Regularidad!AJ$41,\"\")","v":""},{"$f":"IF(Regularidad!AK$4=GastosIngresos!$B36,Regularidad!AK$41,\"\")","v":""},{"$f":"IF(Regularidad!AL$4=GastosIngresos!$B36,Regularidad!AL$41,\"\")","v":""},{"$f":"IF(Regularidad!AM$4=GastosIngresos!$B36,Regularidad!AM$41,\"\")","v":""},{"$f":"IF(Regularidad!AN$4=GastosIngresos!$B36,Regularidad!AN$41,\"\")","v":""},{"$f":"IF(Regularidad!AO$4=GastosIngresos!$B36,Regularidad!AO$41,\"\")","v":""},{"$f":"IF(Regularidad!AP$4=GastosIngresos!$B36,Regularidad!AP$41,\"\")","v":""},{"$f":"IF(Regularidad!AQ$4=GastosIngresos!$B36,Regularidad!AQ$41,\"\")","v":""},{"$f":"IF(Regularidad!AR$4=GastosIngresos!$B36,Regularidad!AR$41,\"\")","v":""},{"$f":"IF(Regularidad!AS$4=GastosIngresos!$B36,Regularidad!AS$41,\"\")","v":""},{"$f":"IF(Regularidad!AT$4=GastosIngresos!$B36,Regularidad!AT$41,\"\")","v":""},{"$f":"IF(Regularidad!AU$4=GastosIngresos!$B36,Regularidad!AU$41,\"\")","v":""},{"$f":"IF(Regularidad!AV$4=GastosIngresos!$B36,Regularidad!AV$41,\"\")","v":""},{"$f":"IF(Regularidad!AW$4=GastosIngresos!$B36,Regularidad!AW$41,\"\")","v":""},{"$f":"IF(Regularidad!AX$4=GastosIngresos!$B36,Regularidad!AX$41,\"\")","v":""},{"$f":"IF(Regularidad!AY$4=GastosIngresos!$B36,Regularidad!AY$41,\"\")","v":""},{"$f":"IF(Regularidad!AZ$4=GastosIngresos!$B36,Regularidad!AZ$41,\"\")","v":""},{"$f":"IF(Regularidad!BA$4=GastosIngresos!$B36,Regularidad!BA$41,\"\")","v":""},{"$f":"IF(Regularidad!BB$4=GastosIngresos!$B36,Regularidad!BB$41,\"\")","v":""},{"$f":"IF(Regularidad!BC$4=GastosIngresos!$B36,Regularidad!BC$41,\"\")","v":""},{"$f":"IF(Regularidad!BD$4=GastosIngresos!$B36,Regularidad!BD$41,\"\")","v":""},0]
["Agosto","Ag",{"$f":"IF(Regularidad!C$4=GastosIngresos!$B37,Regularidad!C$41,\"\")","v":0},{"$f":"IF(Regularidad!D$4=GastosIngresos!$B37,Regularidad!D$41,\"\")","v":0},{"$f":"IF(Regularidad!E$4=GastosIngresos!$B37,Regularidad!E$41,\"\")","v":0},{"$f":"IF(Regularidad!F$4=GastosIngresos!$B37,Regularidad!F$41,\"\")","v":0},{"$f":"IF(Regularidad!G$4=GastosIngresos!$B37,Regularidad!G$41,\"\")","v":0},{"$f":"IF(Regularidad!H$4=GastosIngresos!$B37,Regularidad!H$41,\"\")","v":0},{"$f":"IF(Regularidad!I$4=GastosIngresos!$B37,Regularidad!I$41,\"\")","v":0},{"$f":"IF(Regularidad!J$4=GastosIngresos!$B37,Regularidad!J$41,\"\")","v":0},{"$f":"IF(Regularidad!K$4=GastosIngresos!$B37,Regularidad!K$41,\"\")","v":""},{"$f":"IF(Regularidad!L$4=GastosIngresos!$B37,Regularidad!L$41,\"\")","v":""},{"$f":"IF(Regularidad!M$4=GastosIngresos!$B37,Regularidad!M$41,\"\")","v":""},{"$f":"IF(Regularidad!N$4=GastosIngresos!$B37,Regularidad!N$41,\"\")","v":""},{"$f":"IF(Regularidad!O$4=GastosIngresos!$B37,Regularidad!O$41,\"\")","v":""},{"$f":"IF(Regularidad!P$4=GastosIngresos!$B37,Regularidad!P$41,\"\")","v":""},{"$f":"IF(Regularidad!Q$4=GastosIngresos!$B37,Regularidad!Q$41,\"\")","v":""},{"$f":"IF(Regularidad!R$4=GastosIngresos!$B37,Regularidad!R$41,\"\")","v":""},{"$f":"IF(Regularidad!S$4=GastosIngresos!$B37,Regularidad!S$41,\"\")","v":""},{"$f":"IF(Regularidad!T$4=GastosIngresos!$B37,Regularidad!T$41,\"\")","v":""},{"$f":"IF(Regularidad!U$4=GastosIngresos!$B37,Regularidad!U$41,\"\")","v":""},{"$f":"IF(Regularidad!V$4=GastosIngresos!$B37,Regularidad!V$41,\"\")","v":""},{"$f":"IF(Regularidad!W$4=GastosIngresos!$B37,Regularidad!W$41,\"\")","v":""},{"$f":"IF(Regularidad!X$4=GastosIngresos!$B37,Regularidad!X$41,\"\")","v":""},{"$f":"IF(Regularidad!Y$4=GastosIngresos!$B37,Regularidad!Y$41,\"\")","v":""},{"$f":"IF(Regularidad!Z$4=GastosIngresos!$B37,Regularidad!Z$41,\"\")","v":""},null,null,null,{"$f":"IF(Regularidad!AD$4=GastosIngresos!$B37,Regularidad!AD$41,\"\")","v":""},{"$f":"IF(Regularidad!AE$4=GastosIngresos!$B37,Regularidad!AE$41,\"\")","v":""},{"$f":"IF(Regularidad!AF$4=GastosIngresos!$B37,Regularidad!AF$41,\"\")","v":""},{"$f":"IF(Regularidad!AG$4=GastosIngresos!$B37,Regularidad!AG$41,\"\")","v":""},{"$f":"IF(Regularidad!AH$4=GastosIngresos!$B37,Regularidad!AH$41,\"\")","v":""},{"$f":"IF(Regularidad!AI$4=GastosIngresos!$B37,Regularidad!AI$41,\"\")","v":""},{"$f":"IF(Regularidad!AJ$4=GastosIngresos!$B37,Regularidad!AJ$41,\"\")","v":""},{"$f":"IF(Regularidad!AK$4=GastosIngresos!$B37,Regularidad!AK$41,\"\")","v":""},{"$f":"IF(Regularidad!AL$4=GastosIngresos!$B37,Regularidad!AL$41,\"\")","v":""},{"$f":"IF(Regularidad!AM$4=GastosIngresos!$B37,Regularidad!AM$41,\"\")","v":""},{"$f":"IF(Regularidad!AN$4=GastosIngresos!$B37,Regularidad!AN$41,\"\")","v":""},{"$f":"IF(Regularidad!AO$4=GastosIngresos!$B37,Regularidad!AO$41,\"\")","v":""},{"$f":"IF(Regularidad!AP$4=GastosIngresos!$B37,Regularidad!AP$41,\"\")","v":""},{"$f":"IF(Regularidad!AQ$4=GastosIngresos!$B37,Regularidad!AQ$41,\"\")","v":""},{"$f":"IF(Regularidad!AR$4=GastosIngresos!$B37,Regularidad!AR$41,\"\")","v":""},{"$f":"IF(Regularidad!AS$4=GastosIngresos!$B37,Regularidad!AS$41,\"\")","v":""},{"$f":"IF(Regularidad!AT$4=GastosIngresos!$B37,Regularidad!AT$41,\"\")","v":""},{"$f":"IF(Regularidad!AU$4=GastosIngresos!$B37,Regularidad!AU$41,\"\")","v":""},{"$f":"IF(Regularidad!AV$4=GastosIngresos!$B37,Regularidad!AV$41,\"\")","v":""},{"$f":"IF(Regularidad!AW$4=GastosIngresos!$B37,Regularidad!AW$41,\"\")","v":""},{"$f":"IF(Regularidad!AX$4=GastosIngresos!$B37,Regularidad!AX$41,\"\")","v":""},{"$f":"IF(Regularidad!AY$4=GastosIngresos!$B37,Regularidad!AY$41,\"\")","v":""},{"$f":"IF(Regularidad!AZ$4=GastosIngresos!$B37,Regularidad!AZ$41,\"\")","v":""},{"$f":"IF(Regularidad!BA$4=GastosIngresos!$B37,Regularidad!BA$41,\"\")","v":""},{"$f":"IF(Regularidad!BB$4=GastosIngresos!$B37,Regularidad!BB$41,\"\")","v":""},{"$f":"IF(Regularidad!BC$4=GastosIngresos!$B37,Regularidad!BC$41,\"\")","v":""},{"$f":"IF(Regularidad!BD$4=GastosIngresos!$B37,Regularidad!BD$41,\"\")","v":""},0]
["Septiembre","S",{"$f":"IF(Regularidad!C$4=GastosIngresos!$B38,Regularidad!C$41,\"\")","v":""},{"$f":"IF(Regularidad!D$4=GastosIngresos!$B38,Regularidad!D$41,\"\")","v":""},{"$f":"IF(Regularidad!E$4=GastosIngresos!$B38,Regularidad!E$41,\"\")","v":""},{"$f":"IF(Regularidad!F$4=GastosIngresos!$B38,Regularidad!F$41,\"\")","v":""},{"$f":"IF(Regularidad!G$4=GastosIngresos!$B38,Regularidad!G$41,\"\")","v":""},{"$f":"IF(Regularidad!H$4=GastosIngresos!$B38,Regularidad!H$41,\"\")","v":""},{"$f":"IF(Regularidad!I$4=GastosIngresos!$B38,Regularidad!I$41,\"\")","v":""},{"$f":"IF(Regularidad!J$4=GastosIngresos!$B38,Regularidad!J$41,\"\")","v":""},{"$f":"IF(Regularidad!K$4=GastosIngresos!$B38,Regularidad!K$41,\"\")","v":0},{"$f":"IF(Regularidad!L$4=GastosIngresos!$B38,Regularidad!L$41,\"\")","v":0},{"$f":"IF(Regularidad!M$4=GastosIngresos!$B38,Regularidad!M$41,\"\")","v":0},{"$f":"IF(Regularidad!N$4=GastosIngresos!$B38,Regularidad!N$41,\"\")","v":0},{"$f":"IF(Regularidad!O$4=GastosIngresos!$B38,Regularidad!O$41,\"\")","v":0},{"$f":"IF(Regularidad!P$4=GastosIngresos!$B38,Regularidad!P$41,\"\")","v":""},{"$f":"IF(Regularidad!Q$4=GastosIngresos!$B38,Regularidad!Q$41,\"\")","v":""},{"$f":"IF(Regularidad!R$4=GastosIngresos!$B38,Regularidad!R$41,\"\")","v":""},{"$f":"IF(Regularidad!S$4=GastosIngresos!$B38,Regularidad!S$41,\"\")","v":""},{"$f":"IF(Regularidad!T$4=GastosIngresos!$B38,Regularidad!T$41,\"\")","v":""},{"$f":"IF(Regularidad!U$4=GastosIngresos!$B38,Regularidad!U$41,\"\")","v":""},{"$f":"IF(Regularidad!V$4=GastosIngresos!$B38,Regularidad!V$41,\"\")","v":""},{"$f":"IF(Regularidad!W$4=GastosIngresos!$B38,Regularidad!W$41,\"\")","v":""},{"$f":"IF(Regularidad!X$4=GastosIngresos!$B38,Regularidad!X$41,\"\")","v":""},{"$f":"IF(Regularidad!Y$4=GastosIngresos!$B38,Regularidad!Y$41,\"\")","v":""},{"$f":"IF(Regularidad!Z$4=GastosIngresos!$B38,Regularidad!Z$41,\"\")","v":""},null,null,null,{"$f":"IF(Regularidad!AD$4=GastosIngresos!$B38,Regularidad!AD$41,\"\")","v":""},{"$f":"IF(Regularidad!AE$4=GastosIngresos!$B38,Regularidad!AE$41,\"\")","v":""},{"$f":"IF(Regularidad!AF$4=GastosIngresos!$B38,Regularidad!AF$41,\"\")","v":""},{"$f":"IF(Regularidad!AG$4=GastosIngresos!$B38,Regularidad!AG$41,\"\")","v":""},{"$f":"IF(Regularidad!AH$4=GastosIngresos!$B38,Regularidad!AH$41,\"\")","v":""},{"$f":"IF(Regularidad!AI$4=GastosIngresos!$B38,Regularidad!AI$41,\"\")","v":""},{"$f":"IF(Regularidad!AJ$4=GastosIngresos!$B38,Regularidad!AJ$41,\"\")","v":""},{"$f":"IF(Regularidad!AK$4=GastosIngresos!$B38,Regularidad!AK$41,\"\")","v":""},{"$f":"IF(Regularidad!AL$4=GastosIngresos!$B38,Regularidad!AL$41,\"\")","v":""},{"$f":"IF(Regularidad!AM$4=GastosIngresos!$B38,Regularidad!AM$41,\"\")","v":""},{"$f":"IF(Regularidad!AN$4=GastosIngresos!$B38,Regularidad!AN$41,\"\")","v":""},{"$f":"IF(Regularidad!AO$4=GastosIngresos!$B38,Regularidad!AO$41,\"\")","v":""},{"$f":"IF(Regularidad!AP$4=GastosIngresos!$B38,Regularidad!AP$41,\"\")","v":""},{"$f":"IF(Regularidad!AQ$4=GastosIngresos!$B38,Regularidad!AQ$41,\"\")","v":""},{"$f":"IF(Regularidad!AR$4=GastosIngresos!$B38,Regularidad!AR$41,\"\")","v":""},{"$f":"IF(Regularidad!AS$4=GastosIngresos!$B38,Regularidad!AS$41,\"\")","v":""},{"$f":"IF(Regularidad!AT$4=GastosIngresos!$B38,Regularidad!AT$41,\"\")","v":""},{"$f":"IF(Regularidad!AU$4=GastosIngresos!$B38,Regularidad!AU$41,\"\")","v":""},{"$f":"IF(Regularidad!AV$4=GastosIngresos!$B38,Regularidad!AV$41,\"\")","v":""},{"$f":"IF(Regularidad!AW$4=GastosIngresos!$B38,Regularidad!AW$41,\"\")","v":""},{"$f":"IF(Regularidad!AX$4=GastosIngresos!$B38,Regularidad!AX$41,\"\")","v":""},{"$f":"IF(Regularidad!AY$4=GastosIngresos!$B38,Regularidad!AY$41,\"\")","v":""},{"$f":"IF(Regularidad!AZ$4=GastosIngresos!$B38,Regularidad!AZ$41,\"\")","v":""},{"$f":"IF(Regularidad!BA$4=GastosIngresos!$B38,Regularidad!BA$41,\"\")","v":""},{"$f":"IF(Regularidad!BB$4=GastosIngresos!$B38,Regularidad!BB$41,\"\")","v":""},{"$f":"IF(Regularidad!BC$4=GastosIngresos!$B38,Regularidad!BC$41,\"\")","v":""},{"$f":"IF(Regularidad!BD$4=GastosIngresos!$B38,Regularidad!BD$41,\"\")","v":""},0]
["Octubre","O",{"$f":"IF(Regularidad!C$4=GastosIngresos!$B39,Regularidad!C$41,\"\")","v":""},{"$f":"IF(Regularidad!D$4=GastosIngresos!$B39,Regularidad!D$41,\"\")","v":""},{"$f":"IF(Regularidad!E$4=GastosIngresos!$B39,Regularidad!E$41,\"\")","v":""},{"$f":"IF(Regularidad!F$4=GastosIngresos!$B39,Regularidad!F$41,\"\")","v":""},{"$f":"IF(Regularidad!G$4=GastosIngresos!$B39,Regularidad!G$41,\"\")","v":""},{"$f":"IF(Regularidad!H$4=GastosIngresos!$B39,Regularidad!H$41,\"\")","v":""},{"$f":"IF(Regularidad!I$4=GastosIngresos!$B39,Regularidad!I$41,\"\")","v":""},{"$f":"IF(Regularidad!J$4=GastosIngresos!$B39,Regularidad!J$41,\"\")","v":""},{"$f":"IF(Regularidad!K$4=GastosIngresos!$B39,Regularidad!K$41,\"\")","v":""},{"$f":"IF(Regularidad!L$4=GastosIngresos!$B39,Regularidad!L$41,\"\")","v":""},{"$f":"IF(Regularidad!M$4=GastosIngresos!$B39,Regularidad!M$41,\"\")","v":""},{"$f":"IF(Regularidad!N$4=GastosIngresos!$B39,Regularidad!N$41,\"\")","v":""},{"$f":"IF(Regularidad!O$4=GastosIngresos!$B39,Regularidad!O$41,\"\")","v":""},{"$f":"IF(Regularidad!P$4=GastosIngresos!$B39,Regularidad!P$41,\"\")","v":0},{"$f":"IF(Regularidad!Q$4=GastosIngresos!$B39,Regularidad!Q$41,\"\")","v":0},{"$f":"IF(Regularidad!R$4=GastosIngresos!$B39,Regularidad!R$41,\"\")","v":0},{"$f":"IF(Regularidad!S$4=GastosIngresos!$B39,Regularidad!S$41,\"\")","v":0},{"$f":"IF(Regularidad!T$4=GastosIngresos!$B39,Regularidad!T$41,\"\")","v":0},{"$f":"IF(Regularidad!U$4=GastosIngresos!$B39,Regularidad!U$41,\"\")","v":0},{"$f":"IF(Regularidad!V$4=GastosIngresos!$B39,Regularidad!V$41,\"\")","v":0},{"$f":"IF(Regularidad!W$4=GastosIngresos!$B39,Regularidad!W$41,\"\")","v":0},{"$f":"IF(Regularidad!X$4=GastosIngresos!$B39,Regularidad!X$41,\"\")","v":""},{"$f":"IF(Regularidad!Y$4=GastosIngresos!$B39,Regularidad!Y$41,\"\")","v":""},{"$f":"IF(Regularidad!Z$4=GastosIngresos!$B39,Regularidad!Z$41,\"\")","v":""},null,null,null,{"$f":"IF(Regularidad!AD$4=GastosIngresos!$B39,Regularidad!AD$41,\"\")","v":""},{"$f":"IF(Regularidad!AE$4=GastosIngresos!$B39,Regularidad!AE$41,\"\")","v":""},{"$f":"IF(Regularidad!AF$4=GastosIngresos!$B39,Regularidad!AF$41,\"\")","v":""},{"$f":"IF(Regularidad!AG$4=GastosIngresos!$B39,Regularidad!AG$41,\"\")","v":""},{"$f":"IF(Regularidad!AH$4=GastosIngresos!$B39,Regularidad!AH$41,\"\")","v":""},{"$f":"IF(Regularidad!AI$4=GastosIngresos!$B39,Regularidad!AI$41,\"\")","v":""},{"$f":"IF(Regularidad!AJ$4=GastosIngresos!$B39,Regularidad!AJ$41,\"\")","v":""},{"$f":"IF(Regularidad!AK$4=GastosIngresos!$B39,Regularidad!AK$41,\"\")","v":""},{"$f":"IF(Regularidad!AL$4=GastosIngresos!$B39,Regularidad!AL$41,\"\")","v":""},{"$f":"IF(Regularidad!AM$4=GastosIngresos!$B39,Regularidad!AM$41,\"\")","v":""},{"$f":"IF(Regularidad!AN$4=GastosIngresos!$B39,Regularidad!AN$41,\"\")","v":""},{"$f":"IF(Regularidad!AO$4=GastosIngresos!$B39,Regularidad!AO$41,\"\")","v":""},{"$f":"IF(Regularidad!AP$4=GastosIngresos!$B39,Regularidad!AP$41,\"\")","v":""},{"$f":"IF(Regularidad!AQ$4=GastosIngresos!$B39,Regularidad!AQ$41,\"\")","v":""},{"$f":"IF(Regularidad!AR$4=GastosIngresos!$B39,Regularidad!AR$41,\"\")","v":""},{"$f":"IF(Regularidad!AS$4=GastosIngresos!$B39,Regularidad!AS$41,\"\")","v":""},{"$f":"IF(Regularidad!AT$4=GastosIngresos!$B39,Regularidad!AT$41,\"\")","v":""},{"$f":"IF(Regularidad!AU$4=GastosIngresos!$B39,Regularidad!AU$41,\"\")","v":""},{"$f":"IF(Regularidad!AV$4=GastosIngresos!$B39,Regularidad!AV$41,\"\")","v":""},{"$f":"IF(Regularidad!AW$4=GastosIngresos!$B39,Regularidad!AW$41,\"\")","v":""},{"$f":"IF(Regularidad!AX$4=GastosIngresos!$B39,Regularidad!AX$41,\"\")","v":""},{"$f":"IF(Regularidad!AY$4=GastosIngresos!$B39,Regularidad!AY$41,\"\")","v":""},{"$f":"IF(Regularidad!AZ$4=GastosIngresos!$B39,Regularidad!AZ$41,\"\")","v":""},{"$f":"IF(Regularidad!BA$4=GastosIngresos!$B39,Regularidad!BA$41,\"\")","v":""},{"$f":"IF(Regularidad!BB$4=GastosIngresos!$B39,Regularidad!BB$41,\"\")","v":""},{"$f":"IF(Regularidad!BC$4=GastosIngresos!$B39,Regularidad!BC$41,\"\")","v":""},{"$f":"IF(Regularidad!BD$4=GastosIngresos!$B39,Regularidad!BD$41,\"\")","v":""},0]
["Noviembre","N",{"$f":"IF(Regularidad!C$4=GastosIngresos!$B40,Regularidad!C$41,\"\")","v":""},{"$f":"IF(Regularidad!D$4=GastosIngresos!$B40,Regularidad!D$41,\"\")","v":""},{"$f":"IF(Regularidad!E$4=GastosIngresos!$B40,Regularidad!E$41,\"\")","v":""},{"$f":"IF(Regularidad!F$4=GastosIngresos!$B40,Regularidad!F$41,\"\")","v":""},{"$f":"IF(Regularidad!G$4=GastosIngresos!$B40,Regularidad!G$41,\"\")","v":""},{"$f":"IF(Regularidad!H$4=GastosIngresos!$B40,Regularidad!H$41,\"\")","v":""},{"$f":"IF(Regularidad!I$4=GastosIngresos!$B40,Regularidad!I$41,\"\")","v":""},{"$f":"IF(Regularidad!J$4=GastosIngresos!$B40,Regularidad!J$41,\"\")","v":""},{"$f":"IF(Regularidad!K$4=GastosIngresos!$B40,Regularidad!K$41,\"\")","v":""},{"$f":"IF(Regularidad!L$4=GastosIngresos!$B40,Regularidad!L$41,\"\")","v":""},{"$f":"IF(Regularidad!M$4=GastosIngresos!$B40,Regularidad!M$41,\"\")","v":""},{"$f":"IF(Regularidad!N$4=GastosIngresos!$B40,Regularidad!N$41,\"\")","v":""},{"$f":"IF(Regularidad!O$4=GastosIngresos!$B40,Regularidad!O$41,\"\")","v":""},{"$f":"IF(Regularidad!P$4=GastosIngresos!$B40,Regularidad!P$41,\"\")","v":""},{"$f":"IF(Regularidad!Q$4=GastosIngresos!$B40,Regularidad!Q$41,\"\")","v":""},{"$f":"IF(Regularidad!R$4=GastosIngresos!$B40,Regularidad!R$41,\"\")","v":""},{"$f":"IF(Regularidad!S$4=GastosIngresos!$B40,Regularidad!S$41,\"\")","v":""},{"$f":"IF(Regularidad!T$4=GastosIngresos!$B40,Regularidad!T$41,\"\")","v":""},{"$f":"IF(Regularidad!U$4=GastosIngresos!$B40,Regularidad!U$41,\"\")","v":""},{"$f":"IF(Regularidad!V$4=GastosIngresos!$B40,Regularidad!V$41,\"\")","v":""},{"$f":"IF(Regularidad!W$4=GastosIngresos!$B40,Regularidad!W$41,\"\")","v":""},{"$f":"IF(Regularidad!X$4=GastosIngresos!$B40,Regularidad!X$41,\"\")","v":0},{"$f":"IF(Regularidad!Y$4=GastosIngresos!$B40,Regularidad!Y$41,\"\")","v":0},{"$f":"IF(Regularidad!Z$4=GastosIngresos!$B40,Regularidad!Z$41,\"\")","v":0},{"$f":"IF(Regularidad!AA$4=GastosIngresos!$B40,Regularidad!AA$41,\"\")","v":""},{"$f":"IF(Regularidad!AB$4=GastosIngresos!$B40,Regularidad!AB$41,\"\")","v":""},{"$f":"IF(Regularidad!AC$4=GastosIngresos!$B40,Regularidad!AC$41,\"\")","v":""},{"$f":"IF(Regularidad!AD$4=GastosIngresos!$B40,Regularidad!AD$41,\"\")","v":""},{"$f":"IF(Regularidad!AE$4=GastosIngresos!$B40,Regularidad!AE$41,\"\")","v":""},{"$f":"IF(Regularidad!AF$4=GastosIngresos!$B40,Regularidad!AF$41,\"\")","v":""},{"$f":"IF(Regularidad!AG$4=GastosIngresos!$B40,Regularidad!AG$41,\"\")","v":""},{"$f":"IF(Regularidad!AH$4=GastosIngresos!$B40,Regularidad!AH$41,\"\")","v":""},{"$f":"IF(Regularidad!AI$4=GastosIngresos!$B40,Regularidad!AI$41,\"\")","v":""},{"$f":"IF(Regularidad!AJ$4=GastosIngresos!$B40,Regularidad!AJ$41,\"\")","v":""},{"$f":"IF(Regularidad!AK$4=GastosIngresos!$B40,Regularidad!AK$41,\"\")","v":""},{"$f":"IF(Regularidad!AL$4=GastosIngresos!$B40,Regularidad!AL$41,\"\")","v":""},{"$f":"IF(Regularidad!AM$4=GastosIngresos!$B40,Regularidad!AM$41,\"\")","v":""},{"$f":"IF(Regularidad!AN$4=GastosIngresos!$B40,Regularidad!AN$41,\"\")","v":""},{"$f":"IF(Regularidad!AO$4=GastosIngresos!$B40,Regularidad!AO$41,\"\")","v":""},{"$f":"IF(Regularidad!AP$4=GastosIngresos!$B40,Regularidad!AP$41,\"\")","v":""},{"$f":"IF(Regularidad!AQ$4=GastosIngresos!$B40,Regularidad!AQ$41,\"\")","v":""},{"$f":"IF(Regularidad!AR$4=GastosIngresos!$B40,Regularidad!AR$41,\"\")","v":""},{"$f":"IF(Regularidad!AS$4=GastosIngresos!$B40,Regularidad!AS$41,\"\")","v":""},{"$f":"IF(Regularidad!AT$4=GastosIngresos!$B40,Regularidad!AT$41,\"\")","v":""},{"$f":"IF(Regularidad!AU$4=GastosIngresos!$B40,Regularidad!AU$41,\"\")","v":""},{"$f":"IF(Regularidad!AV$4=GastosIngresos!$B40,Regularidad!AV$41,\"\")","v":""},{"$f":"IF(Regularidad!AW$4=GastosIngresos!$B40,Regularidad!AW$41,\"\")","v":""},{"$f":"IF(Regularidad!AX$4=GastosIngresos!$B40,Regularidad!AX$41,\"\")","v":""},{"$f":"IF(Regularidad!AY$4=GastosIngresos!$B40,Regularidad!AY$41,\"\")","v":""},{"$f":"IF(Regularidad!AZ$4=GastosIngresos!$B40,Regularidad!AZ$41,\"\")","v":""},{"$f":"IF(Regularidad!BA$4=GastosIngresos!$B40,Regularidad!BA$41,\"\")","v":""},{"$f":"IF(Regularidad!BB$4=GastosIngresos!$B40,Regularidad!BB$41,\"\")","v":""},{"$f":"IF(Regularidad!BC$4=GastosIngresos!$B40,Regularidad!BC$41,\"\")","v":""},{"$f":"IF(Regularidad!BD$4=GastosIngresos!$B40,Regularidad!BD$41,\"\")","v":""},{"$f":"SUM(C40:BD40)","v":0}]
["Diciembre","D",{"$f":"IF(Regularidad!C$4=GastosIngresos!$B41,Regularidad!C$41,\"\")","v":""},{"$f":"IF(Regularidad!D$4=GastosIngresos!$B41,Regularidad!D$41,\"\")","v":""},{"$f":"IF(Regularidad!E$4=GastosIngresos!$B41,Regularidad!E$41,\"\")","v":""},{"$f":"IF(Regularidad!F$4=GastosIngresos!$B41,Regularidad!F$41,\"\")","v":""},{"$f":"IF(Regularidad!G$4=GastosIngresos!$B41,Regularidad!G$41,\"\")","v":""},{"$f":"IF(Regularidad!H$4=GastosIngresos!$B41,Regularidad!H$41,\"\")","v":""},{"$f":"IF(Regularidad!I$4=GastosIngresos!$B41,Regularidad!I$41,\"\")","v":""},{"$f":"IF(Regularidad!J$4=GastosIngresos!$B41,Regularidad!J$41,\"\")","v":""},{"$f":"IF(Regularidad!K$4=GastosIngresos!$B41,Regularidad!K$41,\"\")","v":""},{"$f":"IF(Regularidad!L$4=GastosIngresos!$B41,Regularidad!L$41,\"\")","v":""},{"$f":"IF(Regularidad!M$4=GastosIngresos!$B41,Regularidad!M$41,\"\")","v":""},{"$f":"IF(Regularidad!N$4=GastosIngresos!$B41,Regularidad!N$41,\"\")","v":""},{"$f":"IF(Regularidad!O$4=GastosIngresos!$B41,Regularidad!O$41,\"\")","v":""},{"$f":"IF(Regularidad!P$4=GastosIngresos!$B41,Regularidad!P$41,\"\")","v":""},{"$f":"IF(Regularidad!Q$4=GastosIngresos!$B41,Regularidad!Q$41,\"\")","v":""},{"$f":"IF(Regularidad!R$4=GastosIngresos!$B41,Regularidad!R$41,\"\")","v":""},{"$f":"IF(Regularidad!S$4=GastosIngresos!$B41,Regularidad!S$41,\"\")","v":""},{"$f":"IF(Regularidad!T$4=GastosIngresos!$B41,Regularidad!T$41,\"\")","v":""},{"$f":"IF(Regularidad!U$4=GastosIngresos!$B41,Regularidad!U$41,\"\")","v":""},{"$f":"IF(Regularidad!V$4=GastosIngresos!$B41,Regularidad!V$41,\"\")","v":""},{"$f":"IF(Regularidad!W$4=GastosIngresos!$B41,Regularidad!W$41,\"\")","v":""},{"$f":"IF(Regularidad!X$4=GastosIngresos!$B41,Regularidad!X$41,\"\")","v":""},{"$f":"IF(Regularidad!Y$4=GastosIngresos!$B41,Regularidad!Y$41,\"\")","v":""},{"$f":"IF(Regularidad!Z$4=GastosIngresos!$B41,Regularidad!Z$41,\"\")","v":""},null,null,null,{"$f":"IF(Regularidad!AD$4=GastosIngresos!$B41,Regularidad!AD$41,\"\")","v":""},{"$f":"IF(Regularidad!AE$4=GastosIngresos!$B41,Regularidad!AE$41,\"\")","v":""},{"$f":"IF(Regularidad!AF$4=GastosIngresos!$B41,Regularidad!AF$41,\"\")","v":""},{"$f":"IF(Regularidad!AG$4=GastosIngresos!$B41,Regularidad!AG$41,\"\")","v":""},{"$f":"IF(Regularidad!AH$4=GastosIngresos!$B41,Regularidad!AH$41,\"\")","v":""},{"$f":"IF(Regularidad!AI$4=GastosIngresos!$B41,Regularidad!AI$41,\"\")","v":""},{"$f":"IF(Regularidad!AJ$4=GastosIngresos!$B41,Regularidad!AJ$41,\"\")","v":""},{"$f":"IF(Regularidad!AK$4=GastosIngresos!$B41,Regularidad!AK$41,\"\")","v":""},{"$f":"IF(Regularidad!AL$4=GastosIngresos!$B41,Regularidad!AL$41,\"\")","v":""},{"$f":"IF(Regularidad!AM$4=GastosIngresos!$B41,Regularidad!AM$41,\"\")","v":""},{"$f":"IF(Regularidad!AN$4=GastosIngresos!$B41,Regularidad!AN$41,\"\")","v":""},{"$f":"IF(Regularidad!AO$4=GastosIngresos!$B41,Regularidad!AO$41,\"\")","v":""},{"$f":"IF(Regularidad!AP$4=GastosIngresos!$B41,Regularidad!AP$41,\"\")","v":""},{"$f":"IF(Regularidad!AQ$4=GastosIngresos!$B41,Regularidad!AQ$41,\"\")","v":""},{"$f":"IF(Regularidad!AR$4=GastosIngresos!$B41,Regularidad!AR$41,\"\")","v":""},{"$f":"IF(Regularidad!AS$4=GastosIngresos!$B41,Regularidad!AS$41,\"\")","v":""},{"$f":"IF(Regularidad!AT$4=GastosIngresos!$B41,Regularidad!AT$41,\"\")","v":""},{"$f":"IF(Regularidad!AU$4=GastosIngresos!$B41,Regularidad!AU$41,\"\")","v":""},{"$f":"IF(Regularidad!AV$4=GastosIngresos!$B41,Regularidad!AV$41,\"\")","v":""},{"$f":"IF(Regularidad!AW$4=GastosIngresos!$B41,Regularidad!AW$41,\"\")","v":""},{"$f":"IF(Regularidad!AX$4=GastosIngresos!$B41,Regularidad!AX$41,\"\")","v":""},{"$f":"IF(Regularidad!AY$4=GastosIngresos!$B41,Regularidad!AY$41,\"\")","v":""},{"$f":"IF(Regularidad!AZ$4=GastosIngresos!$B41,Regularidad!AZ$41,\"\")","v":""},{"$f":"IF(Regularidad!BA$4=GastosIngresos!$B41,Regularidad!BA$41,\"\")","v":""},{"$f":"IF(Regularidad!BB$4=GastosIngresos!$B41,Regularidad!BB$41,\"\")","v":""},{"$f":"IF(Regularidad!BC$4=GastosIngresos!$B41,Regularidad!BC$41,\"\")","v":""},{"$f":"IF(Regularidad!BD$4=GastosIngresos!$B41,Regularidad!BD$41,\"\")","v":""},{"$f":"SUM(C41:BD41)","v":0}]
[]
["Montaña",null,1,2,3,4,5,6,7,8,9,10,11,12,13,14,15,16,17,18,19,20,21,22,23,24,25,26,27,28,29,30,31,32,33,34,35,36,37,38,39,40,41,42,43,44,45,46,47,48,49,50,51,52,53,54,"Total"]
["Enero","E",{"$f":"IF(Montana!C$4=GastosIngresos!$B44,Montana!C$41,\"\")","v":""},{"$f":"IF(Montana!D$4=GastosIngresos!$B44,Montana!D$41,\"\")","v":""},{"$f":"IF(Montana!E$4=GastosIngresos!$B44,Montana!E$41,\"\")","v":""},{"$f":"IF(Montana!F$4=GastosIngresos!$B44,Montana!F$41,\"\")","v":""},{"$f":"IF(Montana!G$4=GastosIngresos!$B44,Montana!G$41,\"\")","v":""},{"$f":"IF(Montana!H$4=GastosIngresos!$B44,Montana!H$41,\"\")","v":""},{"$f":"IF(Montana!I$4=GastosIngresos!$B44,Montana!I$41,\"\")","v":""},{"$f":"IF(Montana!J$4=GastosIngresos!$B44,Montana!J$41,\"\")","v":""},{"$f":"IF(Montana!K$4=GastosIngresos!$B44,Montana!K$41,\"\")","v":""},{"$f":"IF(Montana!L$4=GastosIngresos!$B44,Montana!L$41,\"\")","v":""},{"$f":"IF(Montana!M$4=GastosIngresos!$B44,Montana!M$41,\"\")","v":""},{"$f":"IF(Montana!N$4=GastosIngresos!$B44,Montana!N$41,\"\")","v":""},{"$f":"IF(Montana!O$4=GastosIngresos!$B44,Montana!O$41,\"\")","v":""},{"$f":"IF(Montana!P$4=GastosIngresos!$B44,Montana!P$41,\"\")","v":""},{"$f":"IF(Montana!Q$4=GastosIngresos!$B44,Montana!Q$41,\"\")","v":""},{"$f":"IF(Montana!R$4=GastosIngresos!$B44,Montana!R$41,\"\")","v":""},{"$f":"IF(Montana!S$4=GastosIngresos!$B44,Montana!S$41,\"\")","v":""},{"$f":"IF(Montana!T$4=GastosIngresos!$B44,Montana!T$41,\"\")","v":""},{"$f":"IF(Montana!U$4=GastosIngresos!$B44,Montana!U$41,\"\")","v":""},{"$f":"IF(Montana!V$4=GastosIngresos!$B44,Montana!V$41,\"\")","v":""},{"$f":"IF(Montana!W$4=GastosIngresos!$B44,Montana!W$41,\"\")","v":""},{"$f":"IF(Montana!X$4=GastosIngresos!$B44,Montana!X$41,\"\")","v":""},{"$f":"IF(Montana!Y$4=GastosIngresos!$B44,Montana!Y$41,\"\")","v":""},{"$f":"IF(Montana!Z$4=GastosIngresos!$B44,Montana!Z$41,\"\")","v":""},null,null,null,{"$f":"IF(Montana!AD$4=GastosIngresos!$B44,Montana!AD$41,\"\")","v":""},{"$f":"IF(Montana!AE$4=GastosIngresos!$B44,Montana!AE$41,\"\")","v":""},{"$f":"IF(Montana!AF$4=GastosIngresos!$B44,Montana!AF$41,\"\")","v":""},{"$f":"IF(Montana!AG$4=GastosIngresos!$B44,Montana!AG$41,\"\")","v":""},{"$f":"IF(Montana!AH$4=GastosIngresos!$B44,Montana!AH$41,\"\")","v":""},{"$f":"IF(Montana!AI$4=GastosIngresos!$B44,Montana!AI$41,\"\")","v":""},{"$f":"IF(Montana!AJ$4=GastosIngresos!$B44,Montana!AJ$41,\"\")","v":""},{"$f":"IF(Montana!AK$4=GastosIngresos!$B44,Montana!AK$41,\"\")","v":""},{"$f":"IF(Montana!AL$4=GastosIngresos!$B44,Montana!AL$41,\"\")","v":""},{"$f":"IF(Montana!AM$4=GastosIngresos!$B44,Montana!AM$41,\"\")","v":""},{"$f":"IF(Montana!AN$4=GastosIngresos!$B44,Montana!AN$41,\"\")","v":""},{"$f":"IF(Montana!AO$4=GastosIngresos!$B44,Montana!AO$41,\"\")","v":""},{"$f":"IF(Montana!AP$4=GastosIngresos!$B44,Montana!AP$41,\"\")","v":""},{"$f":"IF(Montana!AQ$4=GastosIngresos!$B44,Montana!AQ$41,\"\")","v":""},{"$f":"IF(Montana!AR$4=GastosIngresos!$B44,Montana!AR$41,\"\")","v":""},{"$f":"IF(Montana!AS$4=GastosIngresos!$B44,Montana!AS$41,\"\")","v":""},{"$f":"IF(Montana!AT$4=GastosIngresos!$B44,Montana!AT$41,\"\")","v":""},{"$f":"IF(Montana!AU$4=GastosIngresos!$B44,Montana!AU$41,\"\")","v":""},{"$f":"IF(Montana!AV$4=GastosIngresos!$B44,Montana!AV$41,\"\")","v":""},{"$f":"IF(Montana!AW$4=GastosIngresos!$B44,Montana!AW$41,\"\")","v":""},{"$f":"IF(Montana!AX$4=GastosIngresos!$B44,Montana!AX$41,\"\")","v":""},{"$f":"IF(Montana!AY$4=GastosIngresos!$B44,Montana!AY$41,\"\")","v":""},{"$f":"IF(Montana!AZ$4=GastosIngresos!$B44,Montana!AZ$41,\"\")","v":""},{"$f":"IF(Montana!BA$4=GastosIngresos!$B44,Montana!BA$41,\"\")","v":""},{"$f":"IF(Montana!BB$4=GastosIngresos!$B44,Montana!BB$41,\"\")","v":""},{"$f":"IF(Montana!BC$4=GastosIngresos!$B44,Montana!BC$41,\"\")","v":""},{"$f":"IF(Montana!BD$4=GastosIngresos!$B44,Montana!BD$41,\"\")","v":""},{"$f":"SUM(C44:BD44)","v":0}]
["Febrero","F",{"$f":"IF(Montana!C$4=GastosIngresos!$B45,Montana!C$41,\"\")","v":""},{"$f":"IF(Montana!D$4=GastosIngresos!$B45,Montana!D$41,\"\")","v":""},{"$f":"IF(Montana!E$4=GastosIngresos!$B45,Montana!E$41,\"\")","v":""},{"$f":"IF(Montana!F$4=GastosIngresos!$B45,Montana!F$41,\"\")","v":""},{"$f":"IF(Montana!G$4=GastosIngresos!$B45,Montana!G$41,\"\")","v":""},{"$f":"IF(Montana!H$4=GastosIngresos!$B45,Montana!H$41,\"\")","v":""},{"$f":"IF(Montana!I$4=GastosIngresos!$B45,Montana!I$41,\"\")","v":""},{"$f":"IF(Montana!J$4=GastosIngresos!$B45,Montana!J$41,\"\")","v":""},{"$f":"IF(Montana!K$4=GastosIngresos!$B45,Montana!K$41,\"\")","v":""},{"$f":"IF(Montana!L$4=GastosIngresos!$B45,Montana!L$41,\"\")","v":""},{"$f":"IF(Montana!M$4=GastosIngresos!$B45,Montana!M$41,\"\")","v":""},{"$f":"IF(Montana!N$4=GastosIngresos!$B45,Montana!N$41,\"\")","v":""},{"$f":"IF(Montana!O$4=GastosIngresos!$B45,Montana!O$41,\"\")","v":""},{"$f":"IF(Montana!P$4=GastosIngresos!$B45,Montana!P$41,\"\")","v":""},{"$f":"IF(Montana!Q$4=GastosIngresos!$B45,Montana!Q$41,\"\")","v":""},{"$f":"IF(Montana!R$4=GastosIngresos!$B45,Montana!R$41,\"\")","v":""},{"$f":"IF(Montana!S$4=GastosIngresos!$B45,Montana!S$41,\"\")","v":""},{"$f":"IF(Montana!T$4=GastosIngresos!$B45,Montana!T$41,\"\")","v":""},{"$f":"IF(Montana!U$4=GastosIngresos!$B45,Montana!U$41,\"\")","v":""},{"$f":"IF(Montana!V$4=GastosIngresos!$B45,Montana!V$41,\"\")","v":""},{"$f":"IF(Montana!W$4=GastosIngresos!$B45,Montana!W$41,\"\")","v":""},{"$f":"IF(Montana!X$4=GastosIngresos!$B45,Montana!X$41,\"\")","v":""},{"$f":"IF(Montana!Y$4=GastosIngresos!$B45,Montana!Y$41,\"\")","v":""},{"$f":"IF(Montana!Z$4=GastosIngresos!$B45,Montana!Z$41,\"\")","v":""},null,null,null,{"$f":"IF(Montana!AD$4=GastosIngresos!$B45,Montana!AD$41,\"\")","v":""},{"$f":"IF(Montana!AE$4=GastosIngresos!$B45,Montana!AE$41,\"\")","v":""},{"$f":"IF(Montana!AF$4=GastosIngresos!$B45,Montana!AF$41,\"\")","v":""},{"$f":"IF(Montana!AG$4=GastosIngresos!$B45,Montana!AG$41,\"\")","v":""},{"$f":"IF(Montana!AH$4=GastosIngresos!$B45,Montana!AH$41,\"\")","v":""},{"$f":"IF(Montana!AI$4=GastosIngresos!$B45,Montana!AI$41,\"\")","v":""},{"$f":"IF(Montana!AJ$4=GastosIngresos!$B45,Montana!AJ$41,\"\")","v":""},{"$f":"IF(Montana!AK$4=GastosIngresos!$B45,Montana!AK$41,\"\")","v":""},{"$f":"IF(Montana!AL$4=GastosIngresos!$B45,Montana!AL$41,\"\")","v":""},{"$f":"IF(Montana!AM$4=GastosIngresos!$B45,Montana!AM$41,\"\")","v":""},{"$f":"IF(Montana!AN$4=GastosIngresos!$B45,Montana!AN$41,\"\")","v":""},{"$f":"IF(Montana!AO$4=GastosIngresos!$B45,Montana!AO$41,\"\")","v":""},{"$f":"IF(Montana!AP$4=GastosIngresos!$B45,Montana!AP$41,\"\")","v":""},{"$f":"IF(Montana!AQ$4=GastosIngresos!$B45,Montana!AQ$41,\"\")","v":""},{"$f":"IF(Montana!AR$4=GastosIngresos!$B45,Montana!AR$41,\"\")","v":""},{"$f":"IF(Montana!AS$4=GastosIngresos!$B45,Montana!AS$41,\"\")","v":""},{"$f":"IF(Montana!AT$4=GastosIngresos!$B45,Montana!AT$41,\"\")","v":""},{"$f":"IF(Montana!AU$4=GastosIngresos!$B45,Montana!AU$41,\"\")","v":""},{"$f":"IF(Montana!AV$4=GastosIngresos!$B45,Montana!AV$41,\"\")","v":""},{"$f":"IF(Montana!AW$4=GastosIngresos!$B45,Montana!AW$41,\"\")","v":""},{"$f":"IF(Montana!AX$4=GastosIngresos!$B45,Montana!AX$41,\"\")","v":""},{"$f":"IF(Montana!AY$4=GastosIngresos!$B45,Montana!AY$41,\"\")","v":""},{"$f":"IF(Montana!AZ$4=GastosIngresos!$B45,Montana!AZ$41,\"\")","v":""},{"$f":"IF(Montana!BA$4=GastosIngresos!$B45,Montana!BA$41,\"\")","v":""},{"$f":"IF(Montana!BB$4=GastosIngresos!$B45,Montana!BB$41,\"\")","v":""},{"$f":"IF(Montana!BC$4=GastosIngresos!$B45,Montana!BC$41,\"\")","v":""},{"$f":"IF(Montana!BD$4=GastosIngresos!$B45,Montana!BD$41,\"\")","v":""},{"$f":"SUM(C45:BD45)","v":0}]
["Marzo","M",{"$f":"IF(Montana!C$4=GastosIngresos!$B46,Montana!C$41,\"\")","v":""},{"$f":"IF(Montana!D$4=GastosIngresos!$B46,Montana!D$41,\"\")","v":""},{"$f":"IF(Montana!E$4=GastosIngresos!$B46,Montana!E$41,\"\")","v":""},{"$f":"IF(Montana!F$4=GastosIngresos!$B46,Montana!F$41,\"\")","v":""},{"$f":"IF(Montana!G$4=GastosIngresos!$B46,Montana!G$41,\"\")","v":""},{"$f":"IF(Montana!H$4=GastosIngresos!$B46,Montana!H$41,\"\")","v":""},{"$f":"IF(Montana!I$4=GastosIngresos!$B46,Montana!I$41,\"\")","v":""},{"$f":"IF(Montana!J$4=GastosIngresos!$B46,Montana!J$41,\"\")","v":""},{"$f":"IF(Montana!K$4=GastosIngresos!$B46,Montana!K$41,\"\")","v":""},{"$f":"IF(Montana!L$4=GastosIngresos!$B46,Montana!L$41,\"\")","v":""},{"$f":"IF(Montana!M$4=GastosIngresos!$B46,Montana!M$41,\"\")","v":""},{"$f":"IF(Montana!N$4=GastosIngresos!$B46,Montana!N$41,\"\")","v":""},{"$f":"IF(Montana!O$4=GastosIngresos!$B46,Montana!O$41,\"\")","v":""},{"$f":"IF(Montana!P$4=GastosIngresos!$B46,Montana!P$41,\"\")","v":""},{"$f":"IF(Montana!Q$4=GastosIngresos!$B46,Montana!Q$41,\"\")","v":""},{"$f":"IF(Montana!R$4=GastosIngresos!$B46,Montana!R$41,\"\")","v":""},{"$f":"IF(Montana!S$4=GastosIngresos!$B46,Montana!S$41,\"\")","v":""},{"$f":"IF(Montana!T$4=GastosIngresos!$B46,Montana!T$41,\"\")","v":""},{"$f":"IF(Montana!U$4=GastosIngresos!$B46,Montana!U$41,\"\")","v":""},{"$f":"IF(Montana!V$4=GastosIngresos!$B46,Montana!V$41,\"\")","v":""},{"$f":"IF(Montana!W$4=GastosIngresos!$B46,Montana!W$41,\"\")","v":""},{"$f":"IF(Montana!X$4=GastosIngresos!$B46,Montana!X$41,\"\")","v":""},{"$f":"IF(Montana!Y$4=GastosIngresos!$B46,Montana!Y$41,\"\")","v":""},{"$f":"IF(Montana!Z$4=GastosIngresos!$B46,Montana!Z$41,\"\")","v":""},null,null,null,{"$f":"IF(Montana!AD$4=GastosIngresos!$B46,Montana!AD$41,\"\")","v":""},{"$f":"IF(Montana!AE$4=GastosIngresos!$B46,Montana!AE$41,\"\")","v":""},{"$f":"IF(Montana!AF$4=GastosIngresos!$B46,Montana!AF$41,\"\")","v":""},{"$f":"IF(Montana!AG$4=GastosIngresos!$B46,Montana!AG$41,\"\")","v":""},{"$f":"IF(Montana!AH$4=GastosIngresos!$B46,Montana!AH$41,\"\")","v":""},{"$f":"IF(Montana!AI$4=GastosIngresos!$B46,Montana!AI$41,\"\")","v":""},{"$f":"IF(Montana!AJ$4=GastosIngresos!$B46,Montana!AJ$41,\"\")","v":""},{"$f":"IF(Montana!AK$4=GastosIngresos!$B46,Montana!AK$41,\"\")","v":""},{"$f":"IF(Montana!AL$4=GastosIngresos!$B46,Montana!AL$41,\"\")","v":""},{"$f":"IF(Montana!AM$4=GastosIngresos!$B46,Montana!AM$41,\"\")","v":""},{"$f":"IF(Montana!AN$4=GastosIngresos!$B46,Montana!AN$41,\"\")","v":""},{"$f":"IF(Montana!AO$4=GastosIngresos!$B46,Montana!AO$41,\"\")","v":""},{"$f":"IF(Montana!AP$4=GastosIngresos!$B46,Montana!AP$41,\"\")","v":""},{"$f":"IF(Montana!AQ$4=GastosIngresos!$B46,Montana!AQ$41,\"\")","v":""},{"$f":"IF(Montana!AR$4=GastosIngresos!$B46,Montana!AR$41,\"\")","v":""},{"$f":"IF(Montana!AS$4=GastosIngresos!$B46,Montana!AS$41,\"\")","v":""},{"$f":"IF(Montana!AT$4=GastosIngresos!$B46,Montana!AT$41,\"\")","v":""},{"$f":"IF(Montana!AU$4=GastosIngresos!$B46,Montana!AU$41,\"\")","v":""},{"$f":"IF(Montana!AV$4=GastosIngresos!$B46,Montana!AV$41,\"\")","v":""},{"$f":"IF(Montana!AW$4=GastosIngresos!$B46,Montana!AW$41,\"\")","v":""},{"$f":"IF(Montana!AX$4=GastosIngresos!$B46,Montana!AX$41,\"\")","v":""},{"$f":"IF(Montana!AY$4=GastosIngresos!$B46,Montana!AY$41,\"\")","v":""},{"$f":"IF(Montana!AZ$4=GastosIngresos!$B46,Montana!AZ$41,\"\")","v":""},{"$f":"IF(Montana!BA$4=GastosIngresos!$B46,Montana!BA$41,\"\")","v":""},{"$f":"IF(Montana!BB$4=GastosIngresos!$B46,Montana!BB$41,\"\")","v":""},{"$f":"IF(Montana!BC$4=GastosIngresos!$B46,Montana!BC$41,\"\")","v":""},{"$f":"IF(Montana!BD$4=GastosIngresos!$B46,Montana!BD$41,\"\")","v":""},0]
["Abril","A",{"$f":"IF(Montana!C$4=GastosIngresos!$B47,Montana!C$41,\"\")","v":""},{"$f":"IF(Montana!D$4=GastosIngresos!$B47,Montana!D$41,\"\")","v":""},{"$f":"IF(Montana!E$4=GastosIngresos!$B47,Montana!E$41,\"\")","v":""},{"$f":"IF(Montana!F$4=GastosIngresos!$B47,Montana!F$41,\"\")","v":""},{"$f":"IF(Montana!G$4=GastosIngresos!$B47,Montana!G$41,\"\")","v":""},{"$f":"IF(Montana!H$4=GastosIngresos!$B47,Montana!H$41,\"\")","v":""},{"$f":"IF(Montana!I$4=GastosIngresos!$B47,Montana!I$41,\"\")","v":""},{"$f":"IF(Montana!J$4=GastosIngresos!$B47,Montana!J$41,\"\")","v":""},{"$f":"IF(Montana!K$4=GastosIngresos!$B47,Montana!K$41,\"\")","v":""},{"$f":"IF(Montana!L$4=GastosIngresos!$B47,Montana!L$41,\"\")","v":""},{"$f":"IF(Montana!M$4=GastosIngresos!$B47,Montana!M$41,\"\")","v":""},{"$f":"IF(Montana!N$4=GastosIngresos!$B47,Montana!N$41,\"\")","v":""},{"$f":"IF(Montana!O$4=GastosIngresos!$B47,Montana!O$41,\"\")","v":""},{"$f":"IF(Montana!P$4=GastosIngresos!$B47,Montana!P$41,\"\")","v":""},{"$f":"IF(Montana!Q$4=GastosIngresos!$B47,Montana!Q$41,\"\")","v":""},{"$f":"IF(Montana!R$4=GastosIngresos!$B47,Montana!R$41,\"\")","v":""},{"$f":"IF(Montana!S$4=GastosIngresos!$B47,Montana!S$41,\"\")","v":""},{"$f":"IF(Montana!T$4=GastosIngresos!$B47,Montana!T$41,\"\")","v":""},{"$f":"IF(Montana!U$4=GastosIngresos!$B47,Montana!U$41,\"\")","v":""},{"$f":"IF(Montana!V$4=GastosIngresos!$B47,Montana!V$41,\"\")","v":""},{"$f":"IF(Montana!W$4=GastosIngresos!$B47,Montana!W$41,\"\")","v":""},{"$f":"IF(Montana!X$4=GastosIngresos!$B47,Montana!X$41,\"\")","v":""},{"$f":"IF(Montana!Y$4=GastosIngresos!$B47,Montana!Y$41,\"\")","v":""},{"$f":"IF(Montana!Z$4=GastosIngresos!$B47,Montana!Z$41,\"\")","v":""},null,null,null,{"$f":"IF(Montana!AD$4=GastosIngresos!$B47,Montana!AD$41,\"\")","v":""},{"$f":"IF(Montana!AE$4=GastosIngresos!$B47,Montana!AE$41,\"\")","v":""},{"$f":"IF(Montana!AF$4=GastosIngresos!$B47,Montana!AF$41,\"\")","v":""},{"$f":"IF(Montana!AG$4=GastosIngresos!$B47,Montana!AG$41,\"\")","v":""},{"$f":"IF(Montana!AH$4=GastosIngresos!$B47,Montana!AH$41,\"\")","v":""},{"$f":"IF(Montana!AI$4=GastosIngresos!$B47,Montana!AI$41,\"\")","v":""},{"$f":"IF(Montana!AJ$4=GastosIngresos!$B47,Montana!AJ$41,\"\")","v":""},{"$f":"IF(Montana!AK$4=GastosIngresos!$B47,Montana!AK$41,\"\")","v":""},{"$f":"IF(Montana!AL$4=GastosIngresos!$B47,Montana!AL$41,\"\")","v":""},{"$f":"IF(Montana!AM$4=GastosIngresos!$B47,Montana!AM$41,\"\")","v":""},{"$f":"IF(Montana!AN$4=GastosIngresos!$B47,Montana!AN$41,\"\")","v":""},{"$f":"IF(Montana!AO$4=GastosIngresos!$B47,Montana!AO$41,\"\")","v":""},{"$f":"IF(Montana!AP$4=GastosIngresos!$B47,Montana!AP$41,\"\")","v":""},{"$f":"IF(Montana!AQ$4=GastosIngresos!$B47,Montana!AQ$41,\"\")","v":""},{"$f":"IF(Montana!AR$4=GastosIngresos!$B47,Montana!AR$41,\"\")","v":""},{"$f":"IF(Montana!AS$4=GastosIngresos!$B47,Montana!AS$41,\"\")","v":""},{"$f":"IF(Montana!AT$4=GastosIngresos!$B47,Montana!AT$41,\"\")","v":""},{"$f":"IF(Montana!AU$4=GastosIngresos!$B47,Montana!AU$41,\"\")","v":""},{"$f":"IF(Montana!AV$4=GastosIngresos!$B47,Montana!AV$41,\"\")","v":""},{"$f":"IF(Montana!AW$4=GastosIngresos!$B47,Montana!AW$41,\"\")","v":""},{"$f":"IF(Montana!AX$4=GastosIngresos!$B47,Montana!AX$41,\"\")","v":""},{"$f":"IF(Montana!AY$4=GastosIngresos!$B47,Montana!AY$41,\"\")","v":""},{"$f":"IF(Montana!AZ$4=GastosIngresos!$B47,Montana!AZ$41,\"\")","v":""},{"$f":"IF(Montana!BA$4=GastosIngresos!$B47,Montana!BA$41,\"\")","v":""},{"$f":"IF(Montana!BB$4=GastosIngresos!$B47,Montana!BB$41,\"\")","v":""},{"$f":"IF(Montana!BC$4=GastosIngresos!$B47,Montana!BC$41,\"\")","v":""},{"$f":"IF(Montana!BD$4=GastosIngresos!$B47,Montana!BD$41,\"\")","v":""},0]
["Mayo","My",{"$f":"IF(Montana!C$4=GastosIngresos!$B48,Montana!C$41,\"\")","v":""},{"$f":"IF(Montana!D$4=GastosIngresos!$B48,Montana!D$41,\"\")","v":""},{"$f":"IF(Montana!E$4=GastosIngresos!$B48,Montana!E$41,\"\")","v":""},{"$f":"IF(Montana!F$4=GastosIngresos!$B48,Montana!F$41,\"\")","v":""},{"$f":"IF(Montana!G$4=GastosIngresos!$B48,Montana!G$41,\"\")","v":""},{"$f":"IF(Montana!H$4=GastosIngresos!$B48,Montana!H$41,\"\")","v":""},{"$f":"IF(Montana!I$4=GastosIngresos!$B48,Montana!I$41,\"\")","v":""},{"$f":"IF(Montana!J$4=GastosIngresos!$B48,Montana!J$41,\"\")","v":""},{"$f":"IF(Montana!K$4=GastosIngresos!$B48,Montana!K$41,\"\")","v":""},{"$f":"IF(Montana!L$4=GastosIngresos!$B48,Montana!L$41,\"\")","v":""},{"$f":"IF(Montana!M$4=GastosIngresos!$B48,Montana!M$41,\"\")","v":""},{"$f":"IF(Montana!N$4=GastosIngresos!$B48,Montana!N$41,\"\")","v":""},{"$f":"IF(Montana!O$4=GastosIngresos!$B48,Montana!O$41,\"\")","v":""},{"$f":"IF(Montana!P$4=GastosIngresos!$B48,Montana!P$41,\"\")","v":""},{"$f":"IF(Montana!Q$4=GastosIngresos!$B48,Montana!Q$41,\"\")","v":""},{"$f":"IF(Montana!R$4=GastosIngresos!$B48,Montana!R$41,\"\")","v":""},{"$f":"IF(Montana!S$4=GastosIngresos!$B48,Montana!S$41,\"\")","v":""},{"$f":"IF(Montana!T$4=GastosIngresos!$B48,Montana!T$41,\"\")","v":""},{"$f":"IF(Montana!U$4=GastosIngresos!$B48,Montana!U$41,\"\")","v":""},{"$f":"IF(Montana!V$4=GastosIngresos!$B48,Montana!V$41,\"\")","v":""},{"$f":"IF(Montana!W$4=GastosIngresos!$B48,Montana!W$41,\"\")","v":""},{"$f":"IF(Montana!X$4=GastosIngresos!$B48,Montana!X$41,\"\")","v":""},{"$f":"IF(Montana!Y$4=GastosIngresos!$B48,Montana!Y$41,\"\")","v":""},{"$f":"IF(Montana!Z$4=GastosIngresos!$B48,Montana!Z$41,\"\")","v":""},null,null,null,{"$f":"IF(Montana!AD$4=GastosIngresos!$B48,Montana!AD$41,\"\")","v":0},{"$f":"IF(Montana!AE$4=GastosIngresos!$B48,Montana!AE$41,\"\")","v":0},{"$f":"IF(Montana!AF$4=GastosIngresos!$B48,Montana!AF$41,\"\")","v":0},{"$f":"IF(Montana!AG$4=GastosIngresos!$B48,Montana!AG$41,\"\")","v":0},{"$f":"IF(Montana!AH$4=GastosIngresos!$B48,Montana!AH$41,\"\")","v":0},{"$f":"IF(Montana!AI$4=GastosIngresos!$B48,Montana!AI$41,\"\")","v":0},{"$f":"IF(Montana!AJ$4=GastosIngresos!$B48,Montana!AJ$41,\"\")","v":0},{"$f":"IF(Montana!AK$4=GastosIngresos!$B48,Montana!AK$41,\"\")","v":0},{"$f":"IF(Montana!AL$4=GastosIngresos!$B48,Montana!AL$41,\"\")","v":0},{"$f":"IF(Montana!AM$4=GastosIngresos!$B48,Montana!AM$41,\"\")","v":0},{"$f":"IF(Montana!AN$4=GastosIngresos!$B48,Montana!AN$41,\"\")","v":0},{"$f":"IF(Montana!AO$4=GastosIngresos!$B48,Montana!AO$41,\"\")","v":0},{"$f":"IF(Montana!AP$4=GastosIngresos!$B48,Montana!AP$41,\"\")","v":0},{"$f":"IF(Montana!AQ$4=GastosIngresos!$B48,Montana!AQ$41,\"\")","v":0},{"$f":"IF(Montana!AR$4=GastosIngresos!$B48,Montana!AR$41,\"\")","v":0},{"$f":"IF(Montana!AS$4=GastosIngresos!$B48,Montana!AS$41,\"\")","v":0},{"$f":"IF(Montana!AT$4=GastosIngresos!$B48,Montana!AT$41,\"\")","v":0},{"$f":"IF(Montana!AU$4=GastosIngresos!$B48,Montana!AU$41,\"\")","v":""},{"$f":"IF(Montana!AV$4=GastosIngresos!$B48,Montana!AV$41,\"\")","v":""},{"$f":"IF(Montana!AW$4=GastosIngresos!$B48,Montana!AW$41,\"\")","v":""},{"$f":"IF(Montana!AX$4=GastosIngresos!$B48,Montana!AX$41,\"\")","v":""},{"$f":"IF(Montana!AY$4=GastosIngresos!$B48,Montana!AY$41,\"\")","v":""},{"$f":"IF(Montana!AZ$4=GastosIngresos!$B48,Montana!AZ$41,\"\")","v":""},{"$f":"IF(Montana!BA$4=GastosIngresos!$B48,Montana!BA$41,\"\")","v":""},{"$f":"IF(Montana!BB$4=GastosIngresos!$B48,Montana!BB$41,\"\")","v":""},{"$f":"IF(Montana!BC$4=GastosIngresos!$B48,Montana!BC$41,\"\")","v":""},{"$f":"IF(Montana!BD$4=GastosIngresos!$B48,Montana!BD$41,\"\")","v":""},0]
["Junio","J",{"$f":"IF(Montana!C$4=GastosIngresos!$B49,Montana!C$41,\"\")","v":""},{"$f":"IF(Montana!D$4=GastosIngresos!$B49,Montana!D$41,\"\")","v":""},{"$f":"IF(Montana!E$4=GastosIngresos!$B49,Montana!E$41,\"\")","v":""},{"$f":"IF(Montana!F$4=GastosIngresos!$B49,Montana!F$41,\"\")","v":""},{"$f":"IF(Montana!G$4=GastosIngresos!$B49,Montana!G$41,\"\")","v":""},{"$f":"IF(Montana!H$4=GastosIngresos!$B49,Montana!H$41,\"\")","v":""},{"$f":"IF(Montana!I$4=GastosIngresos!$B49,Montana!I$41,\"\")","v":""},{"$f":"IF(Montana!J$4=GastosIngresos!$B49,Montana!J$41,\"\")","v":""},{"$f":"IF(Montana!K$4=GastosIngresos!$B49,Montana!K$41,\"\")","v":""},{"$f":"IF(Montana!L$4=GastosIngresos!$B49,Montana!L$41,\"\")","v":""},{"$f":"IF(Montana!M$4=GastosIngresos!$B49,Montana!M$41,\"\")","v":""},{"$f":"IF(Montana!N$4=GastosIngresos!$B49,Montana!N$41,\"\")","v":""},{"$f":"IF(Montana!O$4=GastosIngresos!$B49,Montana!O$41,\"\")","v":""},{"$f":"IF(Montana!P$4=GastosIngresos!$B49,Montana!P$41,\"\")","v":""},{"$f":"IF(Montana!Q$4=GastosIngresos!$B49,Montana!Q$41,\"\")","v":""},{"$f":"IF(Montana!R$4=GastosIngresos!$B49,Montana!R$41,\"\")","v":""},{"$f":"IF(Montana!S$4=GastosIngresos!$B49,Montana!S$41,\"\")","v":""},{"$f":"IF(Montana!T$4=GastosIngresos!$B49,Montana!T$41,\"\")","v":""},{"$f":"IF(Montana!U$4=GastosIngresos!$B49,Montana!U$41,\"\")","v":""},{"$f":"IF(Montana!V$4=GastosIngresos!$B49,Montana!V$41,\"\")","v":""},{"$f":"IF(Montana!W$4=GastosIngresos!$B49,Montana!W$41,\"\")","v":""},{"$f":"IF(Montana!X$4=GastosIngresos!$B49,Montana!X$41,\"\")","v":""},{"$f":"IF(Montana!Y$4=GastosIngresos!$B49,Montana!Y$41,\"\")","v":""},{"$f":"IF(Montana!Z$4=GastosIngresos!$B49,Montana!Z$41,\"\")","v":""},null,null,null,{"$f":"IF(Montana!AD$4=GastosIngresos!$B49,Montana!AD$41,\"\")","v":""},{"$f":"IF(Montana!AE$4=GastosIngresos!$B49,Montana!AE$41,\"\")","v":""},{"$f":"IF(Montana!AF$4=GastosIngresos!$B49,Montana!AF$41,\"\")","v":""},{"$f":"IF(Montana!AG$4=GastosIngresos!$B49,Montana!AG$41,\"\")","v":""},{"$f":"IF(Montana!AH$4=GastosIngresos!$B49,Montana!AH$41,\"\")","v":""},{"$f":"IF(Montana!AI$4=GastosIngresos!$B49,Montana!AI$41,\"\")","v":""},{"$f":"IF(Montana!AJ$4=GastosIngresos!$B49,Montana!AJ$41,\"\")","v":""},{"$f":"IF(Montana!AK$4=GastosIngresos!$B49,Montana!AK$41,\"\")","v":""},{"$f":"IF(Montana!AL$4=GastosIngresos!$B49,Montana!AL$41,\"\")","v":""},{"$f":"IF(Montana!AM$4=GastosIngresos!$B49,Montana!AM$41,\"\")","v":""},{"$f":"IF(Montana!AN$4=GastosIngresos!$B49,Montana!AN$41,\"\")","v":""},{"$f":"IF(Montana!AO$4=GastosIngresos!$B49,Montana!AO$41,\"\")","v":""},{"$f":"IF(Montana!AP$4=GastosIngresos!$B49,Montana!AP$41,\"\")","v":""},{"$f":"IF(Montana!AQ$4=GastosIngresos!$B49,Montana!AQ$41,\"\")","v":""},{"$f":"IF(Montana!AR$4=GastosIngresos!$B49,Montana!AR$41,\"\")","v":""},{"$f":"IF(Montana!AS$4=GastosIngresos!$B49,Montana!AS$41,\"\")","v":""},{"$f":"IF(Montana!AT$4=GastosIngresos!$B49,Montana!AT$41,\"\")","v":""},{"$f":"IF(Montana!AU$4=GastosIngresos!$B49,Montana!AU$41,\"\")","v":0},{"$f":"IF(Montana!AV$4=GastosIngresos!$B49,Montana!AV$41,\"\")","v":0},{"$f":"IF(Montana!AW$4=GastosIngresos!$B49,Montana!AW$41,\"\")","v":0},{"$f":"IF(Montana!AX$4=GastosIngresos!$B49,Montana!AX$41,\"\")","v":0},{"$f":"IF(Montana!AY$4=GastosIngresos!$B49,Montana!AY$41,\"\")","v":0},{"$f":"IF(Montana!AZ$4=GastosIngresos!$B49,Montana!AZ$41,\"\")","v":0},{"$f":"IF(Montana!BA$4=GastosIngresos!$B49,Montana!BA$41,\"\")","v":0},{"$f":"IF(Montana!BB$4=GastosIngresos!$B49,Montana!BB$41,\"\")","v":0},{"$f":"IF(Montana!BC$4=GastosIngresos!$B49,Montana!BC$41,\"\")","v":0},{"$f":"IF(Montana!BD$4=GastosIngresos!$B49,Montana!BD$41,\"\")","v":0},0]
["Julio","Jl",{"$f":"IF(Montana!C$4=GastosIngresos!$B50,Montana!C$41,\"\")","v":""},{"$f":"IF(Montana!D$4=GastosIngresos!$B50,Montana!D$41,\"\")","v":""},{"$f":"IF(Montana!E$4=GastosIngresos!$B50,Montana!E$41,\"\")","v":""},{"$f":"IF(Montana!F$4=GastosIngresos!$B50,Montana!F$41,\"\")","v":""},{"$f":"IF(Montana!G$4=GastosIngresos!$B50,Montana!G$41,\"\")","v":""},{"$f":"IF(Montana!H$4=GastosIngresos!$B50,Montana!H$41,\"\")","v":""},{"$f":"IF(Montana!I$4=GastosIngresos!$B50,Montana!I$41,\"\")","v":""},{"$f":"IF(Montana!J$4=GastosIngresos!$B50,Montana!J$41,\"\")","v":""},{"$f":"IF(Montana!K$4=GastosIngresos!$B50,Montana!K$41,\"\")","v":""},{"$f":"IF(Montana!L$4=GastosIngresos!$B50,Montana!L$41,\"\")","v":""},{"$f":"IF(Montana!M$4=GastosIngresos!$B50,Montana!M$41,\"\")","v":""},{"$f":"IF(Montana!N$4=GastosIngresos!$B50,Montana!N$41,\"\")","v":""},{"$f":"IF(Montana!O$4=GastosIngresos!$B50,Montana!O$41,\"\")","v":""},{"$f":"IF(Montana!P$4=GastosIngresos!$B50,Montana!P$41,\"\")","v":""},{"$f":"IF(Montana!Q$4=GastosIngresos!$B50,Montana!Q$41,\"\")","v":""},{"$f":"IF(Montana!R$4=GastosIngresos!$B50,Montana!R$41,\"\")","v":""},{"$f":"IF(Montana!S$4=GastosIngresos!$B50,Montana!S$41,\"\")","v":""},{"$f":"IF(Montana!T$4=GastosIngresos!$B50,Montana!T$41,\"\")","v":""},{"$f":"IF(Montana!U$4=GastosIngresos!$B50,Montana!U$41,\"\")","v":""},{"$f":"IF(Montana!V$4=GastosIngresos!$B50,Montana!V$41,\"\")","v":""},{"$f":"IF(Montana!W$4=GastosIngresos!$B50,Montana!W$41,\"\")","v":""},{"$f":"IF(Montana!X$4=GastosIngresos!$B50,Montana!X$41,\"\")","v":""},{"$f":"IF(Montana!Y$4=GastosIngresos!$B50,Montana!Y$41,\"\")","v":""},{"$f":"IF(Montana!Z$4=GastosIngresos!$B50,Montana!Z$41,\"\")","v":""},null,null,null,{"$f":"IF(Montana!AD$4=GastosIngresos!$B50,Montana!AD$41,\"\")","v":""},{"$f":"IF(Montana!AE$4=GastosIngresos!$B50,Montana!AE$41,\"\")","v":""},{"$f":"IF(Montana!AF$4=GastosIngresos!$B50,Montana!AF$41,\"\")","v":""},{"$f":"IF(Montana!AG$4=GastosIngresos!$B50,Montana!AG$41,\"\")","v":""},{"$f":"IF(Montana!AH$4=GastosIngresos!$B50,Montana!AH$41,\"\")","v":""},{"$f":"IF(Montana!AI$4=GastosIngresos!$B50,Montana!AI$41,\"\")","v":""},{"$f":"IF(Montana!AJ$4=GastosIngresos!$B50,Montana!AJ$41,\"\")","v":""},{"$f":"IF(Montana!AK$4=GastosIngresos!$B50,Montana!AK$41,\"\")","v":""},{"$f":"IF(Montana!AL$4=GastosIngresos!$B50,Montana!AL$41,\"\")","v":""},{"$f":"IF(Montana!AM$4=GastosIngresos!$B50,Montana!AM$41,\"\")","v":""},{"$f":"IF(Montana!AN$4=GastosIngresos!$B50,Montana!AN$41,\"\")","v":""},{"$f":"IF(Montana!AO$4=GastosIngresos!$B50,Montana!AO$41,\"\")","v":""},{"$f":"IF(Montana!AP$4=GastosIngresos!$B50,Montana!AP$41,\"\")","v":""},{"$f":"IF(Montana!AQ$4=GastosIngresos!$B50,Montana!AQ$41,\"\")","v":""},{"$f":"IF(Montana!AR$4=GastosIngresos!$B50,Montana!AR$41,\"\")","v":""},{"$f":"IF(Montana!AS$4=GastosIngresos!$B50,Montana!AS$41,\"\")","v":""},{"$f":"IF(Montana!AT$4=GastosIngresos!$B50,Montana!AT$41,\"\")","v":""},{"$f":"IF(Montana!AU$4=GastosIngresos!$B50,Montana!AU$41,\"\")","v":""},{"$f":"IF(Montana!AV$4=GastosIngresos!$B50,Montana!AV$41,\"\")","v":""},{"$f":"IF(Montana!AW$4=GastosIngresos!$B50,Montana!AW$41,\"\")","v":""},{"$f":"IF(Montana!AX$4=GastosIngresos!$B50,Montana!AX$41,\"\")","v":""},{"$f":"IF(Montana!AY$4=GastosIngresos!$B50,Montana!AY$41,\"\")","v":""},{"$f":"IF(Montana!AZ$4=GastosIngresos!$B50,Montana!AZ$41,\"\")","v":""},{"$f":"IF(Montana!BA$4=GastosIngresos!$B50,Montana!BA$41,\"\")","v":""},{"$f":"IF(Montana!BB$4=GastosIngresos!$B50,Montana!BB$41,\"\")","v":""},{"$f":"IF(Montana!BC$4=GastosIngresos!$B50,Montana!BC$41,\"\")","v":""},{"$f":"IF(Montana!BD$4=GastosIngresos!$B50,Montana!BD$41,\"\")","v":""},0]
["Agosto","Ag",{"$f":"IF(Montana!C$4=GastosIngresos!$B51,Montana!C$41,\"\")","v":0},{"$f":"IF(Montana!D$4=GastosIngresos!$B51,Montana!D$41,\"\")","v":0},{"$f":"IF(Montana!E$4=GastosIngresos!$B51,Montana!E$41,\"\")","v":0},{"$f":"IF(Montana!F$4=GastosIngresos!$B51,Montana!F$41,\"\")","v":0},{"$f":"IF(Montana!G$4=GastosIngresos!$B51,Montana!G$41,\"\")","v":0},{"$f":"IF(Montana!H$4=GastosIngresos!$B51,Montana!H$41,\"\")","v":0},{"$f":"IF(Montana!I$4=GastosIngresos!$B51,Montana!I$41,\"\")","v":0},{"$f":"IF(Montana!J$4=GastosIngresos!$B51,Montana!J$41,\"\")","v":0},{"$f":"IF(Montana!K$4=GastosIngresos!$B51,Montana!K$41,\"\")","v":""},{"$f":"IF(Montana!L$4=GastosIngresos!$B51,Montana!L$41,\"\")","v":""},{"$f":"IF(Montana!M$4=GastosIngresos!$B51,Montana!M$41,\"\")","v":""},{"$f":"IF(Montana!N$4=GastosIngresos!$B51,Montana!N$41,\"\")","v":""},{"$f":"IF(Montana!O$4=GastosIngresos!$B51,Montana!O$41,\"\")","v":""},{"$f":"IF(Montana!P$4=GastosIngresos!$B51,Montana!P$41,\"\")","v":""},{"$f":"IF(Montana!Q$4=GastosIngresos!$B51,Montana!Q$41,\"\")","v":""},{"$f":"IF(Montana!R$4=GastosIngresos!$B51,Montana!R$41,\"\")","v":""},{"$f":"IF(Montana!S$4=GastosIngresos!$B51,Montana!S$41,\"\")","v":""},{"$f":"IF(Montana!T$4=GastosIngresos!$B51,Montana!T$41,\"\")","v":""},{"$f":"IF(Montana!U$4=GastosIngresos!$B51,Montana!U$41,\"\")","v":""},{"$f":"IF(Montana!V$4=GastosIngresos!$B51,Montana!V$41,\"\")","v":""},{"$f":"IF(Montana!W$4=GastosIngresos!$B51,Montana!W$41,\"\")","v":""},{"$f":"IF(Montana!X$4=GastosIngresos!$B51,Montana!X$41,\"\")","v":""},{"$f":"IF(Montana!Y$4=GastosIngresos!$B51,Montana!Y$41,\"\")","v":""},{"$f":"IF(Montana!Z$4=GastosIngresos!$B51,Montana!Z$41,\"\")","v":""},null,null,null,{"$f":"IF(Montana!AD$4=GastosIngresos!$B51,Montana!AD$41,\"\")","v":""},{"$f":"IF(Montana!AE$4=GastosIngresos!$B51,Montana!AE$41,\"\")","v":""},{"$f":"IF(Montana!AF$4=GastosIngresos!$B51,Montana!AF$41,\"\")","v":""},{"$f":"IF(Montana!AG$4=GastosIngresos!$B51,Montana!AG$41,\"\")","v":""},{"$f":"IF(Montana!AH$4=GastosIngresos!$B51,Montana!AH$41,\"\")","v":""},{"$f":"IF(Montana!AI$4=GastosIngresos!$B51,Montana!AI$41,\"\")","v":""},{"$f":"IF(Montana!AJ$4=GastosIngresos!$B51,Montana!AJ$41,\"\")","v":""},{"$f":"IF(Montana!AK$4=GastosIngresos!$B51,Montana!AK$41,\"\")","v":""},{"$f":"IF(Montana!AL$4=GastosIngresos!$B51,Montana!AL$41,\"\")","v":""},{"$f":"IF(Montana!AM$4=GastosIngresos!$B51,Montana!AM$41,\"\")","v":""},{"$f":"IF(Montana!AN$4=GastosIngresos!$B51,Montana!AN$41,\"\")","v":""},{"$f":"IF(Montana!AO$4=GastosIngresos!$B51,Montana!AO$41,\"\")","v":""},{"$f":"IF(Montana!AP$4=GastosIngresos!$B51,Montana!AP$41,\"\")","v":""},{"$f":"IF(Montana!AQ$4=GastosIngresos!$B51,Montana!AQ$41,\"\")","v":""},{"$f":"IF(Montana!AR$4=GastosIngresos!$B51,Montana!AR$41,\"\")","v":""},{"$f":"IF(Montana!AS$4=GastosIngresos!$B51,Montana!AS$41,\"\")","v":""},{"$f":"IF(Montana!AT$4=GastosIngresos!$B51,Montana!AT$41,\"\")","v":""},{"$f":"IF(Montana!AU$4=GastosIngresos!$B51,Montana!AU$41,\"\")","v":""},{"$f":"IF(Montana!AV$4=GastosIngresos!$B51,Montana!AV$41,\"\")","v":""},{"$f":"IF(Montana!AW$4=GastosIngresos!$B51,Montana!AW$41,\"\")","v":""},{"$f":"IF(Montana!AX$4=GastosIngresos!$B51,Montana!AX$41,\"\")","v":""},{"$f":"IF(Montana!AY$4=GastosIngresos!$B51,Montana!AY$41,\"\")","v":""},{"$f":"IF(Montana!AZ$4=GastosIngresos!$B51,Montana!AZ$41,\"\")","v":""},{"$f":"IF(Montana!BA$4=GastosIngresos!$B51,Montana!BA$41,\"\")","v":""},{"$f":"IF(Montana!BB$4=GastosIngresos!$B51,Montana!BB$41,\"\")","v":""},{"$f":"IF(Montana!BC$4=GastosIngresos!$B51,Montana!BC$41,\"\")","v":""},{"$f":"IF(Montana!BD$4=GastosIngresos!$B51,Montana!BD$41,\"\")","v":""},0]
["Septiembre","S",{"$f":"IF(Montana!C$4=GastosIngresos!$B52,Montana!C$41,\"\")","v":""},{"$f":"IF(Montana!D$4=GastosIngresos!$B52,Montana!D$41,\"\")","v":""},{"$f":"IF(Montana!E$4=GastosIngresos!$B52,Montana!E$41,\"\")","v":""},{"$f":"IF(Montana!F$4=GastosIngresos!$B52,Montana!F$41,\"\")","v":""},{"$f":"IF(Montana!G$4=GastosIngresos!$B52,Montana!G$41,\"\")","v":""},{"$f":"IF(Montana!H$4=GastosIngresos!$B52,Montana!H$41,\"\")","v":""},{"$f":"IF(Montana!I$4=GastosIngresos!$B52,Montana!I$41,\"\")","v":""},{"$f":"IF(Montana!J$4=GastosIngresos!$B52,Montana!J$41,\"\")","v":""},{"$f":"IF(Montana!K$4=GastosIngresos!$B52,Montana!K$41,\"\")","v":0},{"$f":"IF(Montana!L$4=GastosIngresos!$B52,Montana!L$41,\"\")","v":0},{"$f":"IF(Montana!M$4=GastosIngresos!$B52,Montana!M$41,\"\")","v":0},{"$f":"IF(Montana!N$4=GastosIngresos!$B52,Montana!N$41,\"\")","v":0},{"$f":"IF(Montana!O$4=GastosIngresos!$B52,Montana!O$41,\"\")","v":0},{"$f":"IF(Montana!P$4=GastosIngresos!$B52,Montana!P$41,\"\")","v":""},{"$f":"IF(Montana!Q$4=GastosIngresos!$B52,Montana!Q$41,\"\")","v":""},{"$f":"IF(Montana!R$4=GastosIngresos!$B52,Montana!R$41,\"\")","v":""},{"$f":"IF(Montana!S$4=GastosIngresos!$B52,Montana!S$41,\"\")","v":""},{"$f":"IF(Montana!T$4=GastosIngresos!$B52,Montana!T$41,\"\")","v":""},{"$f":"IF(Montana!U$4=GastosIngresos!$B52,Montana!U$41,\"\")","v":""},{"$f":"IF(Montana!V$4=GastosIngresos!$B52,Montana!V$41,\"\")","v":""},{"$f":"IF(Montana!W$4=GastosIngresos!$B52,Montana!W$41,\"\")","v":""},{"$f":"IF(Montana!X$4=GastosIngresos!$B52,Montana!X$41,\"\")","v":""},{"$f":"IF(Montana!Y$4=GastosIngresos!$B52,Montana!Y$41,\"\")","v":""},{"$f":"IF(Montana!Z$4=GastosIngresos!$B52,Montana!Z$41,\"\")","v":""},null,null,null,{"$f":"IF(Montana!AD$4=GastosIngresos!$B52,Montana!AD$41,\"\")","v":""},{"$f":"IF(Montana!AE$4=GastosIngresos!$B52,Montana!AE$41,\"\")","v":""},{"$f":"IF(Montana!AF$4=GastosIngresos!$B52,Montana!AF$41,\"\")","v":""},{"$f":"IF(Montana!AG$4=GastosIngresos!$B52,Montana!AG$41,\"\")","v":""},{"$f":"IF(Montana!AH$4=GastosIngresos!$B52,Montana!AH$41,\"\")","v":""},{"$f":"IF(Montana!AI$4=GastosIngresos!$B52,Montana!AI$41,\"\")","v":""},{"$f":"IF(Montana!AJ$4=GastosIngresos!$B52,Montana!AJ$41,\"\")","v":""},{"$f":"IF(Montana!AK$4=GastosIngresos!$B52,Montana!AK$41,\"\")","v":""},{"$f":"IF(Montana!AL$4=GastosIngresos!$B52,Montana!AL$41,\"\")","v":""},{"$f":"IF(Montana!AM$4=GastosIngresos!$B52,Montana!AM$41,\"\")","v":""},{"$f":"IF(Montana!AN$4=GastosIngresos!$B52,Montana!AN$41,\"\")","v":""},{"$f":"IF(Montana!AO$4=GastosIngresos!$B52,Montana!AO$41,\"\")","v":""},{"$f":"IF(Montana!AP$4=GastosIngresos!$B52,Montana!AP$41,\"\")","v":""},{"$f":"IF(Montana!AQ$4=GastosIngresos!$B52,Montana!AQ$41,\"\")","v":""},{"$f":"IF(Montana!AR$4=GastosIngresos!$B52,Montana!AR$41,\"\")","v":""},{"$f":"IF(Montana!AS$4=GastosIngresos!$B52,Montana!AS$41,\"\")","v":""},{"$f":"IF(Montana!AT$4=GastosIngresos!$B52,Montana!AT$41,\"\")","v":""},{"$f":"IF(Montana!AU$4=GastosIngresos!$B52,Montana!AU$41,\"\")","v":""},{"$f":"IF(Montana!AV$4=GastosIngresos!$B52,Montana!AV$41,\"\")","v":""},{"$f":"IF(Montana!AW$4=GastosIngresos!$B52,Montana!AW$41,\"\")","v":""},{"$f":"IF(Montana!AX$4=GastosIngresos!$B52,Montana!AX$41,\"\")","v":""},{"$f":"IF(Montana!AY$4=GastosIngresos!$B52,Montana!AY$41,\"\")","v":""},{"$f":"IF(Montana!AZ$4=GastosIngresos!$B52,Montana!AZ$41,\"\")","v":""},{"$f":"IF(Montana!BA$4=GastosIngresos!$B52,Montana!BA$41,\"\")","v":""},{"$f":"IF(Montana!BB$4=GastosIngresos!$B52,Montana!BB$41,\"\")","v":""},{"$f":"IF(Montana!BC$4=GastosIngresos!$B52,Montana!BC$41,\"\")","v":""},{"$f":"IF(Montana!BD$4=GastosIngresos!$B52,Montana!BD$41,\"\")","v":""},0]
["Octubre","O",{"$f":"IF(Montana!C$4=GastosIngresos!$B53,Montana!C$41,\"\")","v":""},{"$f":"IF(Montana!D$4=GastosIngresos!$B53,Montana!D$41,\"\")","v":""},{"$f":"IF(Montana!E$4=GastosIngresos!$B53,Montana!E$41,\"\")","v":""},{"$f":"IF(Montana!F$4=GastosIngresos!$B53,Montana!F$41,\"\")","v":""},{"$f":"IF(Montana!G$4=GastosIngresos!$B53,Montana!G$41,\"\")","v":""},{"$f":"IF(Montana!H$4=GastosIngresos!$B53,Montana!H$41,\"\")","v":""},{"$f":"IF(Montana!I$4=GastosIngresos!$B53,Montana!I$41,\"\")","v":""},{"$f":"IF(Montana!J$4=GastosIngresos!$B53,Montana!J$41,\"\")","v":""},{"$f":"IF(Montana!K$4=GastosIngresos!$B53,Montana!K$41,\"\")","v":""},{"$f":"IF(Montana!L$4=GastosIngresos!$B53,Montana!L$41,\"\")","v":""},{"$f":"IF(Montana!M$4=GastosIngresos!$B53,Montana!M$41,\"\")","v":""},{"$f":"IF(Montana!N$4=GastosIngresos!$B53,Montana!N$41,\"\")","v":""},{"$f":"IF(Montana!O$4=GastosIngresos!$B53,Montana!O$41,\"\")","v":""},{"$f":"IF(Montana!P$4=GastosIngresos!$B53,Montana!P$41,\"\")","v":0},{"$f":"IF(Montana!Q$4=GastosIngresos!$B53,Montana!Q$41,\"\")","v":0},{"$f":"IF(Montana!R$4=GastosIngresos!$B53,Montana!R$41,\"\")","v":0},{"$f":"IF(Montana!S$4=GastosIngresos!$B53,Montana!S$41,\"\")","v":0},{"$f":"IF(Montana!T$4=GastosIngresos!$B53,Montana!T$41,\"\")","v":0},{"$f":"IF(Montana!U$4=GastosIngresos!$B53,Montana!U$41,\"\")","v":0},{"$f":"IF(Montana!V$4=GastosIngresos!$B53,Montana!V$41,\"\")","v":0},{"$f":"IF(Montana!W$4=GastosIngresos!$B53,Montana!W$41,\"\")","v":0},{"$f":"IF(Montana!X$4=GastosIngresos!$B53,Montana!X$41,\"\")","v":""},{"$f":"IF(Montana!Y$4=GastosIngresos!$B53,Montana!Y$41,\"\")","v":""},{"$f":"IF(Montana!Z$4=GastosIngresos!$B53,Montana!Z$41,\"\")","v":""},null,null,null,{"$f":"IF(Montana!AD$4=GastosIngresos!$B53,Montana!AD$41,\"\")","v":""},{"$f":"IF(Montana!AE$4=GastosIngresos!$B53,Montana!AE$41,\"\")","v":""},{"$f":"IF(Montana!AF$4=GastosIngresos!$B53,Montana!AF$41,\"\")","v":""},{"$f":"IF(Montana!AG$4=GastosIngresos!$B53,Montana!AG$41,\"\")","v":""},{"$f":"IF(Montana!AH$4=GastosIngresos!$B53,Montana!AH$41,\"\")","v":""},{"$f":"IF(Montana!AI$4=GastosIngresos!$B53,Montana!AI$41,\"\")","v":""},{"$f":"IF(Montana!AJ$4=GastosIngresos!$B53,Montana!AJ$41,\"\")","v":""},{"$f":"IF(Montana!AK$4=GastosIngresos!$B53,Montana!AK$41,\"\")","v":""},{"$f":"IF(Montana!AL$4=GastosIngresos!$B53,Montana!AL$41,\"\")","v":""},{"$f":"IF(Montana!AM$4=GastosIngresos!$B53,Montana!AM$41,\"\")","v":""},{"$f":"IF(Montana!AN$4=GastosIngresos!$B53,Montana!AN$41,\"\")","v":""},{"$f":"IF(Montana!AO$4=GastosIngresos!$B53,Montana!AO$41,\"\")","v":""},{"$f":"IF(Montana!AP$4=GastosIngresos!$B53,Montana!AP$41,\"\")","v":""},{"$f":"IF(Montana!AQ$4=GastosIngresos!$B53,Montana!AQ$41,\"\")","v":""},{"$f":"IF(Montana!AR$4=GastosIngresos!$B53,Montana!AR$41,\"\")","v":""},{"$f":"IF(Montana!AS$4=GastosIngresos!$B53,Montana!AS$41,\"\")","v":""},{"$f":"IF(Montana!AT$4=GastosIngresos!$B53,Montana!AT$41,\"\")","v":""},{"$f":"IF(Montana!AU$4=GastosIngresos!$B53,Montana!AU$41,\"\")","v":""},{"$f":"IF(Montana!AV$4=GastosIngresos!$B53,Montana!AV$41,\"\")","v":""},{"$f":"IF(Montana!AW$4=GastosIngresos!$B53,Montana!AW$41,\"\")","v":""},{"$f":"IF(Montana!AX$4=GastosIngresos!$B53,Montana!AX$41,\"\")","v":""},{"$f":"IF(Montana!AY$4=GastosIngresos!$B53,Montana!AY$41,\"\")","v":""},{"$f":"IF(Montana!AZ$4=GastosIngresos!$B53,Montana!AZ$41,\"\")","v":""},{"$f":"IF(Montana!BA$4=GastosIngresos!$B53,Montana!BA$41,\"\")","v":""},{"$f":"IF(Montana!BB$4=GastosIngresos!$B53,Montana!BB$41,\"\")","v":""},{"$f":"IF(Montana!BC$4=GastosIngresos!$B53,Montana!BC$41,\"\")","v":""},{"$f":"IF(Montana!BD$4=GastosIngresos!$B53,Montana!BD$41,\"\")","v":""},0]
["Noviembre","N",{"$f":"IF(Montana!C$4=GastosIngresos!$B54,Montana!C$41,\"\")","v":""},{"$f":"IF(Montana!D$4=GastosIngresos!$B54,Montana!D$41,\"\")","v":""},{"$f":"IF(Montana!E$4=GastosIngresos!$B54,Montana!E$41,\"\")","v":""},{"$f":"IF(Montana!F$4=GastosIngresos!$B54,Montana!F$41,\"\")","v":""},{"$f":"IF(Montana!G$4=GastosIngresos!$B54,Montana!G$41,\"\")","v":""},{"$f":"IF(Montana!H$4=GastosIngresos!$B54,Montana!H$41,\"\")","v":""},{"$f":"IF(Montana!I$4=GastosIngresos!$B54,Montana!I$41,\"\")","v":""},{"$f":"IF(Montana!J$4=GastosIngresos!$B54,Montana!J$41,\"\")","v":""},{"$f":"IF(Montana!K$4=GastosIngresos!$B54,Montana!K$41,\"\")","v":""},{"$f":"IF(Montana!L$4=GastosIngresos!$B54,Montana!L$41,\"\")","v":""},{"$f":"IF(Montana!M$4=GastosIngresos!$B54,Montana!M$41,\"\")","v":""},{"$f":"IF(Montana!N$4=GastosIngresos!$B54,Montana!N$41,\"\")","v":""},{"$f":"IF(Montana!O$4=GastosIngresos!$B54,Montana!O$41,\"\")","v":""},{"$f":"IF(Montana!P$4=GastosIngresos!$B54,Montana!P$41,\"\")","v":""},{"$f":"IF(Montana!Q$4=GastosIngresos!$B54,Montana!Q$41,\"\")","v":""},{"$f":"IF(Montana!R$4=GastosIngresos!$B54,Montana!R$41,\"\")","v":""},{"$f":"IF(Montana!S$4=GastosIngresos!$B54,Montana!S$41,\"\")","v":""},{"$f":"IF(Montana!T$4=GastosIngresos!$B54,Montana!T$41,\"\")","v":""},{"$f":"IF(Montana!U$4=GastosIngresos!$B54,Montana!U$41,\"\")","v":""},{"$f":"IF(Montana!V$4=GastosIngresos!$B54,Montana!V$41,\"\")","v":""},{"$f":"IF(Montana!W$4=GastosIngresos!$B54,Montana!W$41,\"\")","v":""},{"$f":"IF(Montana!X$4=GastosIngresos!$B54,Montana!X$41,\"\")","v":0},{"$f":"IF(Montana!Y$4=GastosIngresos!$B54,Montana!Y$41,\"\")","v":0},{"$f":"IF(Montana!Z$4=GastosIngresos!$B54,Montana!Z$41,\"\")","v":0},{"$f":"IF(Montana!AA$4=GastosIngresos!$B54,Montana!AA$41,\"\")","v":0},{"$f":"IF(Montana!AB$4=GastosIngresos!$B54,Montana!AB$41,\"\")","v":0},{"$f":"IF(Montana!AC$4=GastosIngresos!$B54,Montana!AC$41,\"\")","v":0},{"$f":"IF(Montana!AD$4=GastosIngresos!$B54,Montana!AD$41,\"\")","v":""},{"$f":"IF(Montana!AE$4=GastosIngresos!$B54,Montana!AE$41,\"\")","v":""},{"$f":"IF(Montana!AF$4=GastosIngresos!$B54,Montana!AF$41,\"\")","v":""},{"$f":"IF(Montana!AG$4=GastosIngresos!$B54,Montana!AG$41,\"\")","v":""},{"$f":"IF(Montana!AH$4=GastosIngresos!$B54,Montana!AH$41,\"\")","v":""},{"$f":"IF(Montana!AI$4=GastosIngresos!$B54,Montana!AI$41,\"\")","v":""},{"$f":"IF(Montana!AJ$4=GastosIngresos!$B54,Montana!AJ$41,\"\")","v":""},{"$f":"IF(Montana!AK$4=GastosIngresos!$B54,Montana!AK$41,\"\")","v":""},{"$f":"IF(Montana!AL$4=GastosIngresos!$B54,Montana!AL$41,\"\")","v":""},{"$f":"IF(Montana!AM$4=GastosIngresos!$B54,Montana!AM$41,\"\")","v":""},{"$f":"IF(Montana!AN$4=GastosIngresos!$B54,Montana!AN$41,\"\")","v":""},{"$f":"IF(Montana!AO$4=GastosIngresos!$B54,Montana!AO$41,\"\")","v":""},{"$f":"IF(Montana!AP$4=GastosIngresos!$B54,Montana!AP$41,\"\")","v":""},{"$f":"IF(Montana!AQ$4=GastosIngresos!$B54,Montana!AQ$41,\"\")","v":""},{"$f":"IF(Montana!AR$4=GastosIngresos!$B54,Montana!AR$41,\"\")","v":""},{"$f":"IF(Montana!AS$4=GastosIngresos!$B54,Montana!AS$41,\"\")","v":""},{"$f":"IF(Montana!AT$4=GastosIngresos!$B54,Montana!AT$41,\"\")","v":""},{"$f":"IF(Montana!AU$4=GastosIngresos!$B54,Montana!AU$41,\"\")","v":""},{"$f":"IF(Montana!AV$4=GastosIngresos!$B54,Montana!AV$41,\"\")","v":""},{"$f":"IF(Montana!AW$4=GastosIngresos!$B54,Montana!AW$41,\"\")","v":""},{"$f":"IF(Montana!AX$4=GastosIngresos!$B54,Montana!AX$41,\"\")","v":""},{"$f":"IF(Montana!AY$4=GastosIngresos!$B54,Montana!AY$41,\"\")","v":""},{"$f":"IF(Montana!AZ$4=GastosIngresos!$B54,Montana!AZ$41,\"\")","v":""},{"$f":"IF(Montana!BA$4=GastosIngresos!$B54,Montana!BA$41,\"\")","v":""},{"$f":"IF(Montana!BB$4=GastosIngresos!$B54,Montana!BB$41,\"\")","v":""},{"$f":"IF(Montana!BC$4=GastosIngresos!$B54,Montana!BC$41,\"\")","v":""},{"$f":"IF(Montana!BD$4=GastosIngresos!$B54,Montana!BD$41,\"\")","v":""},{"$f":"SUM(C54:BD54)","v":0}]
["Diciembre","D",{"$f":"IF(Montana!C$4=GastosIngresos!$B55,Montana!C$41,\"\")","v":""},{"$f":"IF(Montana!D$4=GastosIngresos!$B55,Montana!D$41,\"\")","v":""},{"$f":"IF(Montana!E$4=GastosIngresos!$B55,Montana!E$41,\"\")","v":""},{"$f":"IF(Montana!F$4=GastosIngresos!$B55,Montana!F$41,\"\")","v":""},{"$f":"IF(Montana!G$4=GastosIngresos!$B55,Montana!G$41,\"\")","v":""},{"$f":"IF(Montana!H$4=GastosIngresos!$B55,Montana!H$41,\"\")","v":""},{"$f":"IF(Montana!I$4=GastosIngresos!$B55,Montana!I$41,\"\")","v":""},{"$f":"IF(Montana!J$4=GastosIngresos!$B55,Montana!J$41,\"\")","v":""},{"$f":"IF(Montana!K$4=GastosIngresos!$B55,Montana!K$41,\"\")","v":""},{"$f":"IF(Montana!L$4=GastosIngresos!$B55,Montana!L$41,\"\")","v":""},{"$f":"IF(Montana!M$4=GastosIngresos!$B55,Montana!M$41,\"\")","v":""},{"$f":"IF(Montana!N$4=GastosIngresos!$B55,Montana!N$41,\"\")","v":""},{"$f":"IF(Montana!O$4=GastosIngresos!$B55,Montana!O$41,\"\")","v":""},{"$f":"IF(Montana!P$4=GastosIngresos!$B55,Montana!P$41,\"\")","v":""},{"$f":"IF(Montana!Q$4=GastosIngresos!$B55,Montana!Q$41,\"\")","v":""},{"$f":"IF(Montana!R$4=GastosIngresos!$B55,Montana!R$41,\"\")","v":""},{"$f":"IF(Montana!S$4=GastosIngresos!$B55,Montana!S$41,\"\")","v":""},{"$f":"IF(Montana!T$4=GastosIngresos!$B55,Montana!T$41,\"\")","v":""},{"$f":"IF(Montana!U$4=GastosIngresos!$B55,Montana!U$41,\"\")","v":""},{"$f":"IF(Montana!V$4=GastosIngresos!$B55,Montana!V$41,\"\")","v":""},{"$f":"IF(Montana!W$4=GastosIngresos!$B55,Montana!W$41,\"\")","v":""},{"$f":"IF(Montana!X$4=GastosIngresos!$B55,Montana!X$41,\"\")","v":""},{"$f":"IF(Montana!Y$4=GastosIngresos!$B55,Montana!Y$41,\"\")","v":""},{"$f":"IF(Montana!Z$4=GastosIngresos!$B55,Montana!Z$41,\"\")","v":""},null,null,null,{"$f":"IF(Montana!AD$4=GastosIngresos!$B55,Montana!AD$41,\"\")","v":""},{"$f":"IF(Montana!AE$4=GastosIngresos!$B55,Montana!AE$41,\"\")","v":""},{"$f":"IF(Montana!AF$4=GastosIngresos!$B55,Montana!AF$41,\"\")","v":""},{"$f":"IF(Montana!AG$4=GastosIngresos!$B55,Montana!AG$41,\"\")","v":""},{"$f":"IF(Montana!AH$4=GastosIngresos!$B55,Montana!AH$41,\"\")","v":""},{"$f":"IF(Montana!AI$4=GastosIngresos!$B55,Montana!AI$41,\"\")","v":""},{"$f":"IF(Montana!AJ$4=GastosIngresos!$B55,Montana!AJ$41,\"\")","v":""},{"$f":"IF(Montana!AK$4=GastosIngresos!$B55,Montana!AK$41,\"\")","v":""},{"$f":"IF(Montana!AL$4=GastosIngresos!$B55,Montana!AL$41,\"\")","v":""},{"$f":"IF(Montana!AM$4=GastosIngresos!$B55,Montana!AM$41,\"\")","v":""},{"$f":"IF(Montana!AN$4=GastosIngresos!$B55,Montana!AN$41,\"\")","v":""},{"$f":"IF(Montana!AO$4=GastosIngresos!$B55,Montana!AO$41,\"\")","v":""},{"$f":"IF(Montana!AP$4=GastosIngresos!$B55,Montana!AP$41,\"\")","v":""},{"$f":"IF(Montana!AQ$4=GastosIngresos!$B55,Montana!AQ$41,\"\")","v":""},{"$f":"IF(Montana!AR$4=GastosIngresos!$B55,Montana!AR$41,\"\")","v":""},{"$f":"IF(Montana!AS$4=GastosIngresos!$B55,Montana!AS$41,\"\")","v":""},{"$f":"IF(Montana!AT$4=GastosIngresos!$B55,Montana!AT$41,\"\")","v":""},{"$f":"IF(Montana!AU$4=GastosIngresos!$B55,Montana!AU$41,\"\")","v":""},{"$f":"IF(Montana!AV$4=GastosIngresos!$B55,Montana!AV$41,\"\")","v":""},{"$f":"IF(Montana!AW$4=GastosIngresos!$B55,Montana!AW$41,\"\")","v":""},{"$f":"IF(Montana!AX$4=GastosIngresos!$B55,Montana!AX$41,\"\")","v":""},{"$f":"IF(Montana!AY$4=GastosIngresos!$B55,Montana!AY$41,\"\")","v":""},{"$f":"IF(Montana!AZ$4=GastosIngresos!$B55,Montana!AZ$41,\"\")","v":""},{"$f":"IF(Montana!BA$4=GastosIngresos!$B55,Montana!BA$41,\"\")","v":""},{"$f":"IF(Montana!BB$4=GastosIngresos!$B55,Montana!BB$41,\"\")","v":""},{"$f":"IF(Montana!BC$4=GastosIngresos!$B55,Montana!BC$41,\"\")","v":""},{"$f":"IF(Montana!BD$4=GastosIngresos!$B55,Montana!BD$41,\"\")","v":""},{"$f":"SUM(C55:BD55)","v":0}]
[]
["Enero",{"$f":"BE16+BE30+BE44+Etapas!C4","v":0}]
[]
[]
[]
[]
[]
[]
[]
[]
[]
[]
[]
[]
[]
[]
[]
["Febrero",{"$f":"BE17+BE31+BE45+Etapas!C5","v":0}]
[]
[]
[]
[]
[]
[]
[]
[]
[]
[]
[]
[]
[]
[]
[]
["Marzo",{"$f":"BE18+BE32+BE46+Etapas!C6","v":0}]
[]
[]
[]
[]
[]
[]
[]
[]
[]
[]
[]
[]
[]
[]
[]
["Abril",{"$f":"BE19+BE33+BE47+Etapas!C7","v":0}]
[]
[]
[]
[]
[]
[]
[]
[]
[]
[]
[]
[]
[]
[]
[]
[]
[]
[]
[]
[]
[]
[]
[]
[]
[]
[]
[]
[]
[]
["Mayo",{"$f":"BE20+BE34+BE48+Etapas!C8","v":0}]
[]
[]
[]
[]
[]
[]
[]
[]
[]
[]
[]
[]
[]
[]
[]
["Junio",{"$f":"BE21+BE35+BE49+Etapas!C9","v":0}]
[]
[]
[]
[]
[]
[]
[]
[]
[]
[]
[]
[]
[]
[]
[]
["Julio",{"$f":"BE22+BE36+BE50+Etapas!C10","v":0}]
[]
[]
[]
[]
[]
[]
[]
[]
[]
[]
[]
[]
[]
[]
[]
["Agosto",{"$f":"BE23+BE37+BE51+Etapas!C11","v":0}]
[]
[]
[]
[]
[]
[]
[]
[]
[]
[]
[]
[]
[]
[]
[]
["Septiembre",{"$f":"BE24+BE38+BE52+Etapas!C12","v":0}]
[]
[]
[]
[]
[]
[]
[]
[]
[]
[]
[]
[]
[]
[]
[]
["Octubre",{"$f":"BE25+BE39+BE53+Etapas!C13","v":0}]
[]
[]
[]
[]
[]
[]
[]
[]
[]
[]
[]
[]
[]
[]
[]
["Noviembre",{"$f":"BE26+BE40+BE54+Etapas!C14","v":0}]
[]
[]
[]
[]
[]
[]
[]
[]
[]
[]
[]
[]
[]
[]
[]
["Diciembre",{"$f":"BE27+BE41+BE55+Etapas!C15","v":0}]
[]
["Enero",{"$f":"BE2","v":0}]
[]
[]
[]
[]
[]
[]
[]
[]
[]
[]
[]
[]
[]
["Febrero",{"$f":"BE3","v":0}]
[]
[]
[]
[]
[]
[]
[]
[]
[]
[]
[]
[]
[]
["Marzo",{"$f":"BE4","v":0}]
[]
[]
[]
[]
[]
[]
[]
[]
[]
[]
[]
[]
[]
["Abril",{"$f":"BE5","v":0}]
[]
[]
[]
[]
[]
[]
[]
[]
[]
[]
[]
[]
[]
["Mayo",{"$f":"BE6","v":0}]
[]
[]
[]
[]
[]
[]
[]
[]
[]
[]
[]
[]
[]
["Junio",{"$f":"BE7","v":0}]
[]
[]
[]
[]
[]
[]
[]
[]
[]
[]
[]
[]
[]
["Julio",{"$f":"BE8","v":0}]
[]
[]
[]
[]
[]
[]
[]
[]
[]
[]
[]
[]
[]
["Agosto",{"$f":"BE9","v":0}]
[]
[]
[]
[]
[]
[]
[]
[]
[]
[]
[]
[]
[]
["Septiembre",{"$f":"BE10","v":0}]
[]
[]
[]
[]
[]
[]
[]
[]
[]
[]
[]
[]
[]
["Octubre",{"$f":"BE11","v":0}]
[]
[]
[]
[]
[]
[]
[]
[]
[]
[]
[]
[]
[]
["Noviembre",{"$f":"BE12","v":0}]
[]
[]
[]
[]
[]
[]
[]
[]
[]
[]
[]
[]
[]
["Diciembre",{"$f":"BE13","v":0}]

{"sheet":"Hoja1","index":3,"n_rows":19,"n_cols":17,"rows_kept":19,"cut":false,"hidden":false,"merged":[[1,1,1,2],[3,1,3,2]]}
[]
[null,"Ver en phpBB code"]
[]
[null,"PRETEMPORADA"]
[null,null,null,null,null,"Enero","Febrero","Marzo","Abril","Mayo","Junio","Julio","Agosto","Septiembre","Octubre","Noviembre","Diciembre"]
[null,"PRESUPUESTO INICIAL:",2500000,null,"PRESUPUESTO INICIAL:",{"$f":"C19","v":-625000},{"$f":"F16","v":-625000},-625000,-625000,-625000,-625000,-625000,-625000,-625000,-625000,-625000,-625000]
[]
[null,"GANANCIAS TOTALES:",{"$f":"SUM(C9:C11)","v":0},null,"GANANCIAS TOTALES:",{"$f":"SUM(F9:F10)","v":0},0,0,0,0,0,0,0,0,0,0,0]
[null,"Fichajes:",null,null,"Resultados:",{"$f":"GastosIngresos!B57","v":0},{"$f":"GastosIngresos!B73","v":0},{"$f":"GastosIngresos!B89","v":0},{"$f":"GastosIngresos!B105","v":0},{"$f":"GastosIngresos!B135","v":0},{"$f":"GastosIngresos!B151","v":0},{"$f":"GastosIngresos!B167","v":0},{"$f":"GastosIngresos!B183","v":0},{"$f":"GastosIngresos!B199","v":0},{"$f":"GastosIngresos!B215","v":0},{"$f":"GastosIngresos!B231","v":0},{"$f":"GastosIngresos!B247","v":0}]
[null,"Cesiones:",null,null,"Otros:",0]
[null,"Otros:"]
[null,null,null,null,"GASTOS TOTALES:",{"$f":"F13+F14","v":0},0,0,0,0,0,0,0,0,0,0,0]
[null,"GASTOS TOTALES:",{"$f":"SUM(C14:C17)","v":3125000},null,"Inscripciones",{"$f":"GastosIngresos!B249","v":0},{"$f":"GastosIngresos!B263","v":0},{"$f":"GastosIngresos!B277","v":0},{"$f":"GastosIngresos!B291","v":0},{"$f":"GastosIngresos!B305","v":0},{"$f":"GastosIngresos!B319","v":0},{"$f":"GastosIngresos!B333","v":0},{"$f":"GastosIngresos!B347","v":0},{"$f":"GastosIngresos!B361","v":0},{"$f":"GastosIngresos!B375","v":0},{"$f":"GastosIngresos!B389","v":0},{"$f":"GastosIngresos!B403","v":0}]
[null,"Fichajes:",null,null,"Otros:"]
[null,"Cesiones:"]
[null,"Salarios:",{"$f":"Plantilla!G36","v":3125000},null,"TOTAL:",{"$f":"F6+F8-F12","v":-625000},-625000,-625000,-625000,-625000,-625000,-625000,-625000,-625000,-625000,-625000,-625000]
[null,"Otros:"]
[]
[null,"TOTAL:",{"$f":"C6+C8-C13","v":-625000}]

{"sheet":"phpBB","index":4,"n_rows":185,"n_cols":7,"rows_kept":185,"cut":false,"hidden":false,"merged":[[172,2,172,3],[18,2,18,3],[32,2,32,3],[46,2,46,3],[60,2,60,3],[74,2,74,3],[88,2,88,3],[102,2,102,3],[116,2,116,3],[130,2,130,3],[144,2,144,3],[158,2,158,3]]}
[]
[null,"[color=orange]",{"$f":"IF(Hoja1!B4<>0,Hoja1!B4,\"\")","v":"PRETEMPORADA"},{"$f":"IF(Hoja1!C4<>0,Hoja1!C4,\"\")","v":""},"[/color]",null,"Usar Enero \nde Plantilla"]
[null,null,{"$f":"IF(Hoja1!B5<>0,Hoja1!B5,\"\")","v":""},{"$f":"IF(Hoja1!C5<>0,Hoja1!C5,\"\")","v":""},null,null,"La pretemporada no se rellena sola, hay que hacerlo manualmente"]
[null,"[color=blue]",{"$f":"IF(Hoja1!B6<>0,Hoja1!B6,\"\")","v":"PRESUPUESTO INICIAL:"},{"$f":"IF(Hoja1!C6<>0,Hoja1!C6,\"\")","v":2500000},"[/color]"]
[null,null,{"$f":"IF(Hoja1!B7<>0,Hoja1!B7,\"\")","v":""},{"$f":"IF(Hoja1!C7<>0,Hoja1!C7,\"\")","v":""}]
[null,"[color=green]",{"$f":"IF(Hoja1!B8<>0,Hoja1!B8,\"\")","v":"GANANCIAS TOTALES:"},{"$f":"IF(Hoja1!C8<>0,Hoja1!C8,\"\")","v":""}]
[null,null,{"$f":"IF(Hoja1!B9<>0,Hoja1!B9,\"\")","v":"Fichajes:"},{"$f":"IF(Hoja1!C9<>0,Hoja1!C9,\"\")","v":""}]
[null,null,{"$f":"IF(Hoja1!B10<>0,Hoja1!B10,\"\")","v":"Cesiones:"},{"$f":"IF(Hoja1!C10<>0,Hoja1!C10,\"\")","v":""}]
[null,null,{"$f":"IF(Hoja1!B11<>0,Hoja1!B11,\"\")","v":"Otros:"},{"$f":"IF(Hoja1!C11<>0,Hoja1!C11,\"\")","v":""}]
[null,null,{"$f":"IF(Hoja1!B12<>0,Hoja1!B12,\"\")","v":""},{"$f":"IF(Hoja1!C12<>0,Hoja1!C12,\"\")","v":""},"[/color]"]
[null,"[color=red]",{"$f":"IF(Hoja1!B13<>0,Hoja1!B13,\"\")","v":"GASTOS TOTALES:"},{"$f":"IF(Hoja1!C13<>0,Hoja1!C13,\"\")","v":3125000}]
[null,null,{"$f":"IF(Hoja1!B14<>0,Hoja1!B14,\"\")","v":"Fichajes:"},{"$f":"IF(Hoja1!C14<>0,Hoja1!C14,\"\")","v":""}]
[null,null,{"$f":"IF(Hoja1!B15<>0,Hoja1!B15,\"\")","v":"Cesiones:"},{"$f":"IF(Hoja1!C15<>0,Hoja1!C15,\"\")","v":""}]
[null,null,{"$f":"IF(Hoja1!B16<>0,Hoja1!B16,\"\")","v":"Salarios:"},{"$f":"IF(Hoja1!C16<>0,Hoja1!C16,\"\")","v":3125000}]
[null,null,{"$f":"IF(Hoja1!B17<>0,Hoja1!B17,\"\")","v":"Otros:"},{"$f":"IF(Hoja1!C17<>0,Hoja1!C17,\"\")","v":""},"[/color]"]
[null,null,{"$f":"IF(Hoja1!B18<>0,Hoja1!B18,\"\")","v":""},{"$f":"IF(Hoja1!C18<>0,Hoja1!C18,\"\")","v":""}]
[null,"[color=blue]",{"$f":"IF(Hoja1!B19<>0,Hoja1!B19,\"\")","v":"TOTAL:"},{"$f":"IF(Hoja1!C19<>0,Hoja1!C19,\"\")","v":-625000},"[/color]"]
[null,null,{"$f":"IF(Hoja1!B20<>0,Hoja1!B20,\"\")","v":""},{"$f":"IF(Hoja1!C20<>0,Hoja1!C20,\"\")","v":""}]
[null,"[color=orange]","Enero",null,"[/color]"]
[]
[null,"[color=blue]",{"$f":"IF(Hoja1!E6<>0,Hoja1!E6,\"\")","v":"PRESUPUESTO INICIAL:"},{"$f":"IF(Hoja1!F6<>0,Hoja1!F6,\"\")","v":-625000},"[/color]"]
[null,null,{"$f":"IF(Hoja1!E7<>0,Hoja1!E7,\"\")","v":""},{"$f":"IF(Hoja1!F7<>0,Hoja1!F7,\"\")","v":""}]
[null,"[color=green]",{"$f":"IF(Hoja1!E8<>0,Hoja1!E8,\"\")","v":"GANANCIAS TOTALES:"},{"$f":"IF(Hoja1!F8<>0,Hoja1!F8,\"\")","v":""}]
[null,null,{"$f":"IF(Hoja1!E9<>0,Hoja1!E9,\"\")","v":"Resultados:"},{"$f":"IF(Hoja1!F9<>0,Hoja1!F9,\"\")","v":""}]
[null,null,{"$f":"IF(Hoja1!E10<>0,Hoja1!E10,\"\")","v":"Otros:"},{"$f":"IF(Hoja1!F10<>0,Hoja1!F10,\"\")","v":""},"[/color]"]
[null,null,{"$f":"IF(Hoja1!E11<>0,Hoja1!E11,\"\")","v":""},{"$f":"IF(Hoja1!F11<>0,Hoja1!F11,\"\")","v":""}]
[null,"[color=red]",{"$f":"IF(Hoja1!E12<>0,Hoja1!E12,\"\")","v":"GASTOS TOTALES:"},{"$f":"IF(Hoja1!F12<>0,Hoja1!F12,\"\")","v":""}]
[null,null,{"$f":"IF(Hoja1!E13<>0,Hoja1!E13,\"\")","v":"Inscripciones"},{"$f":"IF(Hoja1!F13<>0,Hoja1!F13,\"\")","v":""}]
[null,null,{"$f":"IF(Hoja1!E14<>0,Hoja1!E14,\"\")","v":"Otros:"},{"$f":"IF(Hoja1!F14<>0,Hoja1!F14,\"\")","v":""},"[/color]"]
[null,null,{"$f":"IF(Hoja1!E15<>0,Hoja1!E15,\"\")","v":""},{"$f":"IF(Hoja1!F15<>0,Hoja1!F15,\"\")","v":""}]
[null,"[color=blue]",{"$f":"IF(Hoja1!E16<>0,Hoja1!E16,\"\")","v":"TOTAL:"},{"$f":"IF(Hoja1!F16<>0,Hoja1!F16,\"\")","v":-625000},"[/color]"]
[]
[null,{"$f":"IF(B19<>0,B19,\"\")","v":"[color=orange]"},"Febrero",null,{"$f":"IF(E19<>0,E19,\"\")","v":"[/color]"}]
[null,{"$f":"IF(B20<>0,B20,\"\")","v":""},null,null,{"$f":"IF(E20<>0,E20,\"\")","v":""}]
[null,"[color=blue]","PRESUPUESTO INICIAL:",{"$f":"IF(Hoja1!G6<>0,Hoja1!G6,\"\")","v":-625000},"[/color]"]
[null,"","",{"$f":"IF(Hoja1!G7<>0,Hoja1!G7,\"\")","v":""},""]
[null,"[color=green]","GANANCIAS TOTALES:",{"$f":"IF(Hoja1!G8<>0,Hoja1!G8,\"\")","v":""},""]
[null,"","Resultados:",{"$f":"IF(Hoja1!G9<>0,Hoja1!G9,\"\")","v":""},""]
[null,"","Otros:",{"$f":"IF(Hoja1!G10<>0,Hoja1!G10,\"\")","v":""},{"$f":"IF(E25<>0,E25,\"\")","v":"[/color]"}]
[null,"","",{"$f":"IF(Hoja1!G11<>0,Hoja1!G11,\"\")","v":""},""]
[null,"[color=red]","GASTOS TOTALES:",{"$f":"IF(Hoja1!G12<>0,Hoja1!G12,\"\")","v":""},{"$f":"IF(E25<>0,E25,\"\")","v":"[/color]"}]
[null,"","Inscripciones",{"$f":"IF(Hoja1!G13<>0,Hoja1!G13,\"\")","v":""},""]
[null,"","Otros:",{"$f":"IF(Hoja1!G14<>0,Hoja1!G14,\"\")","v":""},"[/color]"]
[null,"","",{"$f":"IF(Hoja1!G15<>0,Hoja1!G15,\"\")","v":""},""]
[null,"[color=blue]","TOTAL:",{"$f":"IF(Hoja1!G16<>0,Hoja1!G16,\"\")","v":-625000},"[/color]"]
[null,"",null,null,""]
[null,"[color=orange]","Marzo",null,"[/color]"]
[null,"",null,null,""]
[null,"[color=blue]","PRESUPUESTO INICIAL:",{"$f":"IF(Hoja1!H6<>0,Hoja1!H6,\"\")","v":-625000},"[/color]"]
[null,"","",{"$f":"IF(Hoja1!H7<>0,Hoja1!H7,\"\")","v":""},""]
[null,"[color=green]","GANANCIAS TOTALES:",{"$f":"IF(Hoja1!H8<>0,Hoja1!H8,\"\")","v":""},""]
[null,"","Resultados:",{"$f":"IF(Hoja1!H9<>0,Hoja1!H9,\"\")","v":""},""]
[null,"","Otros:",{"$f":"IF(Hoja1!H10<>0,Hoja1!H10,\"\")","v":""},"[/color]"]
[null,"","",{"$f":"IF(Hoja1!H11<>0,Hoja1!H11,\"\")","v":""},""]
[null,"[color=red]","GASTOS TOTALES:",{"$f":"IF(Hoja1!H12<>0,Hoja1!H12,\"\")","v":""},"[/color]"]
[null,"","Inscripciones",{"$f":"IF(Hoja1!H13<>0,Hoja1!H13,\"\")","v":""},""]
[null,"","Otros:",{"$f":"IF(Hoja1!H14<>0,Hoja1!H14,\"\")","v":""},"[/color]"]
[null,"","",{"$f":"IF(Hoja1!H15<>0,Hoja1!H15,\"\")","v":""},""]
[null,"[color=blue]","TOTAL:",{"$f":"IF(Hoja1!H16<>0,Hoja1!H16,\"\")","v":-625000},"[/color]"]
[null,"",null,null,""]
[null,"[color=orange]","Abril",null,"[/color]"]
[null,"",null,null,""]
[null,"[color=blue]","PRESUPUESTO INICIAL:",{"$f":"IF(Hoja1!I6<>0,Hoja1!I6,\"\")","v":-625000},"[/color]"]
[null,"","",{"$f":"IF(Hoja1!I7<>0,Hoja1!I7,\"\")","v":""},""]
[null,"[color=green]","GANANCIAS TOTALES:",{"$f":"IF(Hoja1!I8<>0,Hoja1!I8,\"\")","v":""},""]
[null,"","Resultados:",{"$f":"IF(Hoja1!I9<>0,Hoja1!I9,\"\")","v":""},""]
[null,"","Otros:",{"$f":"IF(Hoja1!I10<>0,Hoja1!I10,\"\")","v":""},"[/color]"]
[null,"","",{"$f":"IF(Hoja1!I11<>0,Hoja1!I11,\"\")","v":""},""]
[null,"[color=red]","GASTOS TOTALES:",{"$f":"IF(Hoja1!I12<>0,Hoja1!I12,\"\")","v":""},"[/color]"]
[null,"","Inscripciones",{"$f":"IF(Hoja1!I13<>0,Hoja1!I13,\"\")","v":""},""]
[null,"","Otros:",{"$f":"IF(Hoja1!I14<>0,Hoja1!I14,\"\")","v":""},"[/color]"]
[null,"","",{"$f":"IF(Hoja1!I15<>0,Hoja1!I15,\"\")","v":""},""]
[null,"[color=blue]","TOTAL:",{"$f":"IF(Hoja1!I16<>0,Hoja1!I16,\"\")","v":-625000},"[/color]"]
[null,"",null,null,""]
[null,"[color=orange]","Mayo",null,"[/color]"]
[null,"",null,null,""]
[null,"[color=blue]","PRESUPUESTO INICIAL:",{"$f":"IF(Hoja1!J6<>0,Hoja1!J6,\"\")","v":-625000},"[/color]"]
[null,"","",{"$f":"IF(Hoja1!J7<>0,Hoja1!J7,\"\")","v":""},""]
[null,"[color=green]","GANANCIAS TOTALES:",{"$f":"IF(Hoja1!J8<>0,Hoja1!J8,\"\")","v":""},""]
[null,"","Resultados:",{"$f":"IF(Hoja1!J9<>0,Hoja1!J9,\"\")","v":""},""]
[null,"","Otros:",{"$f":"IF(Hoja1!J10<>0,Hoja1!J10,\"\")","v":""},"[/color]"]
[null,"","",{"$f":"IF(Hoja1!J11<>0,Hoja1!J11,\"\")","v":""},""]
[null,"[color=red]","GASTOS TOTALES:",{"$f":"IF(Hoja1!J12<>0,Hoja1!J12,\"\")","v":""},"[/color]"]
[null,"","Inscripciones",{"$f":"IF(Hoja1!J13<>0,Hoja1!J13,\"\")","v":""},""]
[null,"","Otros:",{"$f":"IF(Hoja1!J14<>0,Hoja1!J14,\"\")","v":""},"[/color]"]
[null,"","",{"$f":"IF(Hoja1!J15<>0,Hoja1!J15,\"\")","v":""},""]
[null,"[color=blue]","TOTAL:",{"$f":"IF(Hoja1!J16<>0,Hoja1!J16,\"\")","v":-625000},"[/color]"]
[null,"",null,null,""]
[null,"[color=orange]","Junio",null,"[/color]"]
[null,"",null,null,""]
[null,"[color=blue]","PRESUPUESTO INICIAL:",{"$f":"IF(Hoja1!K6<>0,Hoja1!K6,\"\")","v":-625000},"[/color]"]
[null,"","",{"$f":"IF(Hoja1!K7<>0,Hoja1!K7,\"\")","v":""},""]
[null,"[color=green]","GANANCIAS TOTALES:",{"$f":"IF(Hoja1!K8<>0,Hoja1!K8,\"\")","v":""},""]
[null,"","Resultados:",{"$f":"IF(Hoja1!K9<>0,Hoja1!K9,\"\")","v":""},""]
[null,"","Otros:",{"$f":"IF(Hoja1!K10<>0,Hoja1!K10,\"\")","v":""},{"$f":"IF(E81<>0,E81,\"\")","v":"[/color]"}]
[null,"","",{"$f":"IF(Hoja1!K11<>0,Hoja1!K11,\"\")","v":""},""]
[null,"[color=red]","GASTOS TOTALES:",{"$f":"IF(Hoja1!K12<>0,Hoja1!K12,\"\")","v":""},"[/color]"]
[null,{"$f":"IF(B84<>0,B84,\"\")","v":""},"Inscripciones",{"$f":"IF(Hoja1!K13<>0,Hoja1!K13,\"\")","v":""},{"$f":"IF(E84<>0,E84,\"\")","v":""}]
[null,"","Otros:",{"$f":"IF(Hoja1!K14<>0,Hoja1!K14,\"\")","v":""},"[/color]"]
[null,"","",{"$f":"IF(Hoja1!K15<>0,Hoja1!K15,\"\")","v":""},""]
[null,"[color=blue]","TOTAL:",{"$f":"IF(Hoja1!K16<>0,Hoja1!K16,\"\")","v":-625000},"[/color]"]
[null,"",null,null,""]
[null,"[color=orange]","Julio",null,"[/color]"]
[null,"",null,null,""]
[null,"[color=blue]","PRESUPUESTO INICIAL:",{"$f":"IF(Hoja1!L6<>0,Hoja1!L6,\"\")","v":-625000},"[/color]"]
[null,"","",{"$f":"IF(Hoja1!L7<>0,Hoja1!L7,\"\")","v":""},""]
[null,"[color=green]","GANANCIAS TOTALES:",{"$f":"IF(Hoja1!L8<>0,Hoja1!L8,\"\")","v":""},""]
[null,"","Resultados:",{"$f":"IF(Hoja1!L9<>0,Hoja1!L9,\"\")","v":""},""]
[null,"","Otros:",{"$f":"IF(Hoja1!L10<>0,Hoja1!L10,\"\")","v":""},"[/color]"]
[null,"","",{"$f":"IF(Hoja1!L11<>0,Hoja1!L11,\"\")","v":""},""]
[null,"[color=red]","GASTOS TOTALES:",{"$f":"IF(Hoja1!L12<>0,Hoja1!L12,\"\")","v":""},"[/color]"]
[null,"","Inscripciones",{"$f":"IF(Hoja1!L13<>0,Hoja1!L13,\"\")","v":""},""]
[null,"","Otros:",{"$f":"IF(Hoja1!L14<>0,Hoja1!L14,\"\")","v":""},"[/color]"]
[null,"","",{"$f":"IF(Hoja1!L15<>0,Hoja1!L15,\"\")","v":""},""]
[null,"[color=blue]","TOTAL:",{"$f":"IF(Hoja1!L16<>0,Hoja1!L16,\"\")","v":-625000},"[/color]"]
[null,"",null,null,""]
[null,"[color=orange]","Agosto",null,"[/color]"]
[null,"",null,null,""]
[null,"[color=blue]","PRESUPUESTO INICIAL:",{"$f":"IF(Hoja1!M6<>0,Hoja1!M6,\"\")","v":-625000},"[/color]"]
[null,"","",{"$f":"IF(Hoja1!M7<>0,Hoja1!M7,\"\")","v":""},""]
[null,"[color=green]","GANANCIAS TOTALES:",{"$f":"IF(Hoja1!M8<>0,Hoja1!M8,\"\")","v":""},""]
[null,"","Resultados:",{"$f":"IF(Hoja1!M9<>0,Hoja1!M9,\"\")","v":""},""]
[null,"","Otros:",{"$f":"IF(Hoja1!M10<>0,Hoja1!M10,\"\")","v":""},"[/color]"]
[null,"","",{"$f":"IF(Hoja1!M11<>0,Hoja1!M11,\"\")","v":""},""]
[null,"[color=red]","GASTOS TOTALES:",{"$f":"IF(Hoja1!M12<>0,Hoja1!M12,\"\")","v":""},"[/color]"]
[null,"","Inscripciones",{"$f":"IF(Hoja1!M13<>0,Hoja1!M13,\"\")","v":""},""]
[null,"","Otros:",{"$f":"IF(Hoja1!M14<>0,Hoja1!M14,\"\")","v":""},"[/color]"]
[null,"","",{"$f":"IF(Hoja1!M15<>0,Hoja1!M15,\"\")","v":""},""]
[null,"[color=blue]","TOTAL:",{"$f":"IF(Hoja1!M16<>0,Hoja1!M16,\"\")","v":-625000},"[/color]"]
[null,"",null,null,""]
[null,"[color=orange]","Septiembre",null,"[/color]"]
[null,"",null,null,""]
[null,"[color=blue]","PRESUPUESTO INICIAL:",{"$f":"IF(Hoja1!N6<>0,Hoja1!N6,\"\")","v":-625000},"[/color]"]
[null,"","",{"$f":"IF(Hoja1!N7<>0,Hoja1!N7,\"\")","v":""},""]
[null,"[color=green]","GANANCIAS TOTALES:",{"$f":"IF(Hoja1!N8<>0,Hoja1!N8,\"\")","v":""},""]
[null,"","Resultados:",{"$f":"IF(Hoja1!N9<>0,Hoja1!N9,\"\")","v":""},""]
[null,"","Otros:",{"$f":"IF(Hoja1!N10<>0,Hoja1!N10,\"\")","v":""},"[/color]"]
[null,"","",{"$f":"IF(Hoja1!N11<>0,Hoja1!N11,\"\")","v":""},""]
[null,"[color=red]","GASTOS TOTALES:",{"$f":"IF(Hoja1!N12<>0,Hoja1!N12,\"\")","v":""},"[/color]"]
[null,"","Inscripciones",{"$f":"IF(Hoja1!N13<>0,Hoja1!N13,\"\")","v":""},""]
[null,"","Otros:",{"$f":"IF(Hoja1!N14<>0,Hoja1!N14,\"\")","v":""},"[/color]"]
[null,"","",{"$f":"IF(Hoja1!N15<>0,Hoja1!N15,\"\")","v":""},""]
[null,"[color=blue]","TOTAL:",{"$f":"IF(Hoja1!N16<>0,Hoja1!N16,\"\")","v":-625000},"[/color]"]
[null,"",null,null,""]
[null,"[color=orange]","Octubre",null,"[/color]"]
[null,"",null,null,""]
[null,"[color=blue]","PRESUPUESTO INICIAL:",{"$f":"IF(Hoja1!O6<>0,Hoja1!O6,\"\")","v":-625000},"[/color]"]
[null,"","",{"$f":"IF(Hoja1!O7<>0,Hoja1!O7,\"\")","v":""},""]
[null,"[color=green]","GANANCIAS TOTALES:",{"$f":"IF(Hoja1!O8<>0,Hoja1!O8,\"\")","v":""},""]
[null,"","Resultados:",{"$f":"IF(Hoja1!O9<>0,Hoja1!O9,\"\")","v":""},""]
[null,"","Otros:",{"$f":"IF(Hoja1!O10<>0,Hoja1!O10,\"\")","v":""},"[/color]"]
[null,"","",{"$f":"IF(Hoja1!O11<>0,Hoja1!O11,\"\")","v":""},""]
[null,"[color=red]","GASTOS TOTALES:",{"$f":"IF(Hoja1!O12<>0,Hoja1!O12,\"\")","v":""},"[/color]"]
[null,"","Inscripciones",{"$f":"IF(Hoja1!O13<>0,Hoja1!O13,\"\")","v":""},""]
[null,"","Otros:",{"$f":"IF(Hoja1!O14<>0,Hoja1!O14,\"\")","v":""},"[/color]"]
[null,"","",{"$f":"IF(Hoja1!O15<>0,Hoja1!O15,\"\")","v":""},""]
[null,"[color=blue]","TOTAL:",{"$f":"IF(Hoja1!O16<>0,Hoja1!O16,\"\")","v":-625000},"[/color]"]
[null,"",null,null,""]
[null,"[color=orange]","Noviembre",null,"[/color]"]
[null,"",null,null,""]
[null,"[color=blue]","PRESUPUESTO INICIAL:",{"$f":"IF(Hoja1!P6<>0,Hoja1!P6,\"\")","v":-625000},"[/color]"]
[null,{"$f":"IF(B148<>0,B148,\"\")","v":""},"",{"$f":"IF(Hoja1!P7<>0,Hoja1!P7,\"\")","v":""},{"$f":"IF(E148<>0,E148,\"\")","v":""}]
[null,"[color=green]","GANANCIAS TOTALES:",{"$f":"IF(Hoja1!P8<>0,Hoja1!P8,\"\")","v":""},""]
[null,"","Resultados:",{"$f":"IF(Hoja1!P9<>0,Hoja1!P9,\"\")","v":""},""]
[null,"","Otros:",{"$f":"IF(Hoja1!P10<>0,Hoja1!P10,\"\")","v":""},"[/color]"]
[null,"","",{"$f":"IF(Hoja1!P11<>0,Hoja1!P11,\"\")","v":""},""]
[null,"[color=red]","GASTOS TOTALES:",{"$f":"IF(Hoja1!P12<>0,Hoja1!P12,\"\")","v":""},"[/color]"]
[null,"","Inscripciones",{"$f":"IF(Hoja1!P13<>0,Hoja1!P13,\"\")","v":""},""]
[null,"","Otros:",{"$f":"IF(Hoja1!P14<>0,Hoja1!P14,\"\")","v":""},"[/color]"]
[null,"","",{"$f":"IF(Hoja1!P15<>0,Hoja1!P15,\"\")","v":""},""]
[null,"[color=blue]","TOTAL:",{"$f":"IF(Hoja1!P16<>0,Hoja1!P16,\"\")","v":-625000},"[/color]"]
[null,"",null,null,""]
[null,"[color=orange]","Diciembre",null,"[/color]"]
[null,"",null,null,""]
[null,"[color=blue]","PRESUPUESTO INICIAL:",{"$f":"IF(Hoja1!Q6<>0,Hoja1!Q6,\"\")","v":-625000},"[/color]"]
[null,"","",{"$f":"IF(Hoja1!Q7<>0,Hoja1!Q7,\"\")","v":""},""]
[null,"[color=green]","GANANCIAS TOTALES:",{"$f":"IF(Hoja1!Q8<>0,Hoja1!Q8,\"\")","v":""},""]
[null,"","Resultados:",{"$f":"IF(Hoja1!Q9<>0,Hoja1!Q9,\"\")","v":""},""]
[null,"","Otros:",{"$f":"IF(Hoja1!Q10<>0,Hoja1!Q10,\"\")","v":""},"[/color]"]
[null,"","",{"$f":"IF(Hoja1!Q11<>0,Hoja1!Q11,\"\")","v":""},""]
[null,"[color=red]","GASTOS TOTALES:",{"$f":"IF(Hoja1!Q12<>0,Hoja1!Q12,\"\")","v":""},"[/color]"]
[null,"","Inscripciones",{"$f":"IF(Hoja1!Q13<>0,Hoja1!Q13,\"\")","v":""},""]
[null,"","Otros:",{"$f":"IF(Hoja1!Q14<>0,Hoja1!Q14,\"\")","v":""},"[/color]"]
[null,"","",{"$f":"IF(Hoja1!Q15<>0,Hoja1!Q15,\"\")","v":""},""]
[null,"[color=blue]","TOTAL:",{"$f":"IF(Hoja1!Q16<>0,Hoja1!Q16,\"\")","v":-625000},"[/color]"]

{"sheet":"Plantilla","index":5,"n_rows":37,"n_cols":10,"rows_kept":37,"cut":false,"hidden":false,"merged":[[35,2,35,3],[1,3,1,4],[36,2,36,5],[24,9,24,10],[1,9,17,17]]}
[null,"País","País",null,"Año","Edad","Contrato","Años"]
[null,null,null,"Año actual:",null,2013,null,null,null,"Foto de la plantilla"]
[null,"ITA",{"$f":"\":\"&B3&\":\"","v":":ITA:"},"Vincenzo Nibali",1985,{"$f":"$F$2-E3","v":28},350000,1]
[null,"ESP",":ESP:","Samuel Sánchez",1979,34,325000,2]
[null,"FRA",":FRA:","Jean-Cr. Péraud",1978,35,310000,3]
[null,"IRL",":IRL:","Daniel Martin",1987,26,300000,2]
[null,"ESP",":ESP:","José Joaquin Rojas",1986,27,275000,2]
[null,"ESP",":ESP:","Fran Ventoso",1983,30,250000,1]
[null,"POR",":POR:","Rui Costa",1987,26,225000,2]
[null,"AUS",":AUS:","Christopher Sutton",1985,28,200000,3]
[null,"RUS",":RUS:","Vladimir Karpets",1980,33,175000,1]
[null,"NZL",":NZL:","Julian Dean",1976,37,150000,1]
[null,"ALE",":ALE:","Andreas Klier",1977,36,125000,1]
[null,"ITA",":ITA:","Elia Viviani",1990,23,100000,2]
[null,"ESP",":ESP:","Daniel Navarro",1984,29,90000,3]
[null,"SUI",":SUI:","Johann Tschopp",1983,30,70000,3]
[null,"VEN",":VEN:","Miguel A. Ubeto",1977,36,50000,2]
[null,"HOL",":HOL:","Tom-Jelte Slagter",1990,23,40000,3]
[null,"ITA",":ITA:","Fabio Sabatini",1986,27,30000,3]
[null,"SLO",":SLO:","Jure Kocjan",1985,28,30000,2]
[null,"POL",":POL:","Przemyslaw Niemiec",1981,32,15000,2]
[null,"POR",":POR:","Sergio Paulinho",1981,32,15000,3]
[]
[]
[]
[]
[]
[]
[]
[]
[]
[]
[]
[]
[]
[null,null,"Totales",null,null,{"$f":"AVERAGE(F3:F33)","v":30},{"$f":"SUM(G3:G33)","v":3125000},{"$f":"AVERAGE(H3:H33)","v":2.1}]
[null,null,"Total a pagar",null,null,null,{"$f":"G36/2","v":1562500}]

{"sheet":"Inscripciones","index":6,"n_rows":42,"n_cols":113,"rows_kept":42,"cut":false,"hidden":false,"merged":[[3,112,4,112],[39,58,39,61],[0,55,4,55]]}
[".",null,"Campeonatos Nacionales ITT","Campeonatos Nacionales RR","Santos Tour Down Under","Milán-San Remo","Omloop","Tour de Flandres","E3 Prijs Vlaanderen-Harelbeke","Gent-Wevelgem","Paris-Roubaix","Strade Bianche","Paris-Niza","Amstel Gold Race","Flecha Valona","Lieja-Bastoña-Lieja","Dauphiné Libéré","Tour de France","Chrono des Nations","GP du Québec","Vuelta al País Vasco","Critérium International","Hamburguer Turn","GP de Montréal","GP de Lombardía","Clásica San Sebastián","Campeonatos del Mundo: Contrarreloj por Equipos","Campeonatos del Mundo: Contrarreloj Individual ","Campeonatos del Mundo en Ruta","Paris-Roubaix (1 Día) -- GC","Grand Prix Cycliste de Montreal (1 Dia) -- TC","Ronde van Drenthe (1 Dia) -- PC","Vuelta a Burgos (5 Dias) -- PV","Paris - Bruxelles (1 Dia) -- TC","CN Sur de Europa: Contrarreloj Individual (1 Dia) CN","CN Este de Europa: Contrarreloj Individual (1 Dia) CN","CN Norte de Europa: Contrarreloj Individual (1 Dia) CN","CN America: Contrarreloj Individual (1 Dia) CN","CN Resto del Mundo: Contrarreloj Individual (1 Dia) CN","CN Sur de Europa: Ruta en Carretera (1 Dia) CN","CN Este de Europa: Ruta en Carretera (1 Dia) CN","CN Norte de Europa: Ruta en Carretera (1 Dia) CN","CN America: Ruta en Carretera (1 Dia) CN","CN Resto del Mundo: Ruta en Carretera (1 Dia) CN","Milano - Torino (1 Dia) -- TC","Il Lombardía - Clasica de Lombardia (1 Día) -- GC","Vuelta españa (21 Dias) -- GV","Flèche Brabançonne (1 Día) -- TC","Giro del Trentino (4 Dias) -- PV","Tour of Beijing (5 Dias) -- TV","Chrono des Nations (1 Día) -- PC","Japan Cup (1 Dia) -- PC","Gante-Wevelgen (1 Día) -- MC","Campeonatos del Mundo: Contrarreloj por Equipos (1 Día) -- MCE","Campeonatos del Mundo: Contrarreloj Individual (1 Día) -- MCI","Total",{"$f":"'Consulta de Inscripciones'!B2","v":"Santos Tour Down Under"},null,{"$f":"C1","v":"Campeonatos Nacionales ITT"},{"$f":"D1","v":"Campeonatos Nacionales RR"},"Santos Tour Down Under","Milán-San Remo","Omloop","Tour de Flandres","E3 Prijs Vlaanderen-Harelbeke","Gent-Wevelgem","Paris-Roubaix","Strade Bianche","Paris-Niza","Amstel Gold Race","Flecha Valona","Lieja-Bastoña-Lieja","Dauphiné Libéré","Tour de France","Chrono des Nations","GP du Québec","Vuelta al País Vasco","Critérium International","Hamburguer Turn","GP de Montréal","GP de Lombardía","Clásica San Sebastián","Campeonatos del Mundo: Contrarreloj por Equipos","Campeonatos del Mundo: Contrarreloj Individual ","Campeonatos del Mundo en Ruta","Paris-Roubaix (1 Día) -- GC","Grand Prix Cycliste de Montreal (1 Dia) -- TC","Ronde van Drenthe (1 Dia) -- PC","Vuelta a Burgos (5 Dias) -- PV","Paris - Bruxelles (1 Dia) -- TC","CN Sur de Europa: Contrarreloj Individual (1 Dia) CN","CN Este de Europa: Contrarreloj Individual (1 Dia) CN","CN Norte de Europa: Contrarreloj Individual (1 Dia) CN","CN America: Contrarreloj Individual (1 Dia) CN","CN Resto del Mundo: Contrarreloj Individual (1 Dia) CN","CN Sur de Europa: Ruta en Carretera (1 Dia) CN","CN Este de Europa: Ruta en Carretera (1 Dia) CN","CN Norte de Europa: Ruta en Carretera (1 Dia) CN","CN America: Ruta en Carretera (1 Dia) CN","CN Resto del Mundo: Ruta en Carretera (1 Dia) CN","Milano - Torino (1 Dia) -- TC","Il Lombardía - Clasica de Lombardia (1 Día) -- GC","Vuelta españa (21 Dias) -- GV","Flèche Brabançonne (1 Día) -- TC","Giro del Trentino (4 Dias) -- PV","Tour of Beijing (5 Dias) -- TV","Chrono des Nations (1 Día) -- PC","Japan Cup (1 Dia) -- PC","Gante-Wevelgen (1 Día) -- MC","Campeonatos del Mundo: Contrarreloj por Equipos (1 Día) -- MCE","Campeonatos del Mundo: Contrarreloj Individual (1 Día) -- MCI","Total"]
[null,"Días",1,1,6,1,1,1,1,1,1,1,8,1,1,1,8,21,1,1,6,3,1,1,1,1,1,1,1,1,1,1,5,1,1,1,1,1,1,1,1,1,1,1,1,1,21,1,4,5,1,1,1,1,1]
[null,"Mes","Ag","Ag","Ag","Ag","Ag","Ag","Ag","Ag","Ag","Ag","S","S","S","S","S","O","O","O","O","O","O","O","O","N","N","N","N",null,"My","My","My","My","My","My","My","My","My","My","My","My","My","My","My","My","J","J","J","J","J","J","J","J","J",null,"J","J","J","J","J","J","J","J","J","J","J","J","J","J","J","J","J","J","J","J","J","J","J","J","J","J","J","J","J","J","J","J","J","J","J","J","J","J","J","J","J","J","J","J","J","J","J","J","J","J","J","J","J","J","J","J","Códigos"]
[null,"Tipo",null,null,"2.HC","1.UWT",1.1000000000000001,"1.UWT","1.HC","1.HC","1.UWT",1.1000000000000001,"2.UWT","1.HC","1.HC","1.UWT","2.UWT","GV",1.1000000000000001,1.1000000000000001,"2.HC",2.1,1.1000000000000001,"1.HC","1.UWT","1.HC","WC TTT","WC ITT","WC RR","TC","TC","PC","PV","TC","CN","CN","CN","CN","CN","CN","CN","CN","CN","CN","TC","GC","GV","TC","PV","TV","PC","PC","MC","MCE","MCI",null,null,null,null,null,null,null,null,null,null,null,null,null,null,null,null,null,null,null,null,null,null,null,null,null,null,null,null,null,null,null,null,null,null,null,null,null,null,null,null,null,null,null,null,null,null,null,null,null,null,null,null,null,null,null,null,null,"Cambiar los precios"]
[null,"Precio",0,0,{"$f":"LOOKUP(E4,Categorias,Precios)","v":8000},{"$f":"LOOKUP(F4,Categorias,Precios)","v":8000},1200,8000,4800,4800,8000,1200,8000,4800,4800,8000,8000,100000,1200,1200,8000,1600,1200,4800,8000,4800,2000,2000,6000,6000,6000,6000,6000,6000,{"$f":"LOOKUP(AI4,Categorias,Precios)","v":8000},8000,8000,8000,8000,8000,8000,8000,8000,8000,6000,8000,100000,6000,6000,6000,6000,6000,6000,6000,6000]
[null,{"$f":"IF(Plantilla!D3<>0,Plantilla!D3,\"\")","v":"Vincenzo Nibali"},null,null,null,null,null,null,null,null,null,null,null,null,null,null,null,null,null,null,null,null,null,null,null,null,null,null,null,null,null,null,null,null,null,null,null,null,null,null,null,null,null,null,null,null,null,null,null,null,null,null,null,null,null,{"$f":"SUM(E6:AC6)","v":0},{"$f":"INDIRECT(ADDRESS(ROW(),MATCH($BE$1,carreras,0)+2))","v":0},{"$f":"IF(BE6=1,B6,\"\")","v":""},{"$f":"C6*C$2","v":0},{"$f":"D6*D$2","v":0},{"$f":"E6*E$2","v":0},{"$f":"F6*F$2","v":0},{"$f":"G6*G$2","v":0},{"$f":"H6*H$2","v":0},{"$f":"I6*I$2","v":0},{"$f":"J6*J$2","v":0},{"$f":"K6*K$2","v":0},{"$f":"L6*L$2","v":0},{"$f":"M6*M$2","v":0},{"$f":"N6*N$2","v":0},{"$f":"O6*O$2","v":0},{"$f":"P6*P$2","v":0},{"$f":"Q6*Q$2","v":0},{"$f":"R6*R$2","v":0},{"$f":"S6*S$2","v":0},{"$f":"T6*T$2","v":0},{"$f":"U6*U$2","v":0},{"$f":"V6*V$2","v":0},{"$f":"W6*W$2","v":0},{"$f":"X6*X$2","v":0},{"$f":"Y6*Y$2","v":0},{"$f":"Z6*Z$2","v":0},{"$f":"AA6*AA$2","v":0},{"$f":"AB6*AB$2","v":0},{"$f":"AC6*AC$2","v":0},{"$f":"AD6*AD$2","v":0},{"$f":"AE6*AE$2","v":0},{"$f":"AF6*AF$2","v":0},{"$f":"AG6*AG$2","v":0},{"$f":"AH6*AH$2","v":0},{"$f":"AI6*AI$2","v":0},{"$f":"AJ6*AJ$2","v":0},{"$f":"AK6*AK$2","v":0},{"$f":"AL6*AL$2","v":0},{"$f":"AM6*AM$2","v":0},{"$f":"AN6*AN$2","v":0},{"$f":"AO6*AO$2","v":0},{"$f":"AP6*AP$2","v":0},{"$f":"AQ6*AQ$2","v":0},{"$f":"AR6*AR$2","v":0},{"$f":"AS6*AS$2","v":0},{"$f":"AT6*AT$2","v":0},{"$f":"AU6*AU$2","v":0},{"$f":"AV6*AV$2","v":0},{"$f":"AW6*AW$2","v":0},{"$f":"AX6*AX$2","v":0},{"$f":"AY6*AY$2","v":0},{"$f":"AZ6*AZ$2","v":0},{"$f":"BA6*BA$2","v":0},{"$f":"BB6*BB$2","v":0},{"$f":"BC6*BC$2","v":0},{"$f":"BD6*BD$2","v":0},{"$f":"SUM(BG6:DH6)","v":0}]
[null,{"$f":"IF(Plantilla!D4<>0,Plantilla!D4,\"\")","v":"Samuel Sánchez"},null,null,null,null,null,null,null,null,null,null,null,null,null,null,null,null,null,null,null,null,null,null,null,null,null,null,null,null,null,null,null,null,null,null,null,null,null,null,null,null,null,null,null,null,null,null,null,null,null,null,null,null,null,{"$f":"SUM(E7:AC7)","v":0},0,{"$f":"IF(BE7=1,B7,\"\")","v":""},0,0,0,0,0,0,0,0,0,0,0,0,0,0,0,0,0,0,{"$f":"U7*U$2","v":0},0,0,0,0,0,0,0,0,0,0,0,0,0,0,0,0,0,0,0,0,0,0,0,0,0,0,0,0,0,0,0,0,{"$f":"BB7*BB$2","v":0},0,0,{"$f":"SUM(BG7:DH7)","v":0}]
[null,{"$f":"IF(Plantilla!D5<>0,Plantilla!D5,\"\")","v":"Jean-Cr. Péraud"},null,null,null,null,null,null,null,null,null,null,null,null,null,null,null,null,null,null,null,null,null,null,null,null,null,null,null,null,null,null,null,null,null,null,null,null,null,null,null,null,null,null,null,null,null,null,null,null,null,null,null,null,null,{"$f":"SUM(E8:AC8)","v":0},0,{"$f":"IF(BE8=1,B8,\"\")","v":""},{"$f":"C8*C$2","v":0},{"$f":"D8*D$2","v":0},{"$f":"E8*E$2","v":0},{"$f":"F8*F$2","v":0},{"$f":"G8*G$2","v":0},{"$f":"H8*H$2","v":0},{"$f":"I8*I$2","v":0},{"$f":"J8*J$2","v":0},{"$f":"K8*K$2","v":0},{"$f":"L8*L$2","v":0},{"$f":"M8*M$2","v":0},{"$f":"N8*N$2","v":0},{"$f":"O8*O$2","v":0},{"$f":"P8*P$2","v":0},{"$f":"Q8*Q$2","v":0},{"$f":"R8*R$2","v":0},{"$f":"S8*S$2","v":0},{"$f":"T8*T$2","v":0},{"$f":"U8*U$2","v":0},{"$f":"V8*V$2","v":0},{"$f":"W8*W$2","v":0},0,{"$f":"Y8*Y$2","v":0},{"$f":"Z8*Z$2","v":0},{"$f":"AA8*AA$2","v":0},{"$f":"AB8*AB$2","v":0},{"$f":"AC8*AC$2","v":0},{"$f":"AD8*AD$2","v":0},{"$f":"AE8*AE$2","v":0},{"$f":"AF8*AF$2","v":0},{"$f":"AG8*AG$2","v":0},{"$f":"AH8*AH$2","v":0},{"$f":"AI8*AI$2","v":0},{"$f":"AJ8*AJ$2","v":0},{"$f":"AK8*AK$2","v":0},{"$f":"AL8*AL$2","v":0},{"$f":"AM8*AM$2","v":0},{"$f":"AN8*AN$2","v":0},{"$f":"AO8*AO$2","v":0},{"$f":"AP8*AP$2","v":0},{"$f":"AQ8*AQ$2","v":0},{"$f":"AR8*AR$2","v":0},{"$f":"AS8*AS$2","v":0},{"$f":"AT8*AT$2","v":0},{"$f":"AU8*AU$2","v":0},{"$f":"AV8*AV$2","v":0},{"$f":"AW8*AW$2","v":0},{"$f":"AX8*AX$2","v":0},{"$f":"AY8*AY$2","v":0},{"$f":"AZ8*AZ$2","v":0},{"$f":"BA8*BA$2","v":0},{"$f":"BB8*BB$2","v":0},{"$f":"BC8*BC$2","v":0},{"$f":"BD8*BD$2","v":0},{"$f":"SUM(BG8:DH8)","v":0}]
[null,{"$f":"IF(Plantilla!D6<>0,Plantilla!D6,\"\")","v":"Daniel Martin"},null,null,null,null,null,null,null,null,null,null,null,null,null,null,null,null,null,null,null,null,null,null,null,null,null,null,null,null,null,null,null,null,null,null,null,null,null,null,null,null,null,null,null,null,null,null,null,null,null,null,null,null,null,0,0,"",0,0,0,0,0,0,0,0,0,0,0,0,0,0,0,0,0,0,{"$f":"U9*U$2","v":0},0,0,0,0,0,0,0,0,0,0,0,0,0,0,0,0,0,0,0,0,0,0,0,0,0,0,0,0,0,0,0,0,0,0,0,0]
[null,{"$f":"IF(Plantilla!D7<>0,Plantilla!D7,\"\")","v":"José Joaquin Rojas"},null,null,null,null,null,null,null,null,null,null,null,null,null,null,null,null,null,null,null,null,null,null,null,null,null,null,null,null,null,null,null,null,null,null,null,null,null,null,null,null,null,null,null,null,null,null,null,null,null,null,null,null,null,0,0,"",0,0,0,0,0,0,0,0,0,0,0,0,0,0,0,0,0,0,0,0,0,0,0,0,0,0,0,0,0,0,0,0,0,0,0,0,0,0,0,0,0,0,0,0,0,0,0,0,0,0,0,0,0,0,0]
[null,{"$f":"IF(Plantilla!D8<>0,Plantilla!D8,\"\")","v":"Fran Ventoso"},null,null,null,null,null,null,null,null,null,null,null,null,null,null,null,null,null,null,null,null,null,null,null,null,null,null,null,null,null,null,null,null,null,null,null,null,null,null,null,null,null,null,null,null,null,null,null,null,null,null,null,null,null,0,0,"",0,0,0,0,0,0,0,0,0,0,0,0,0,0,0,0,0,0,0,0,0,0,0,0,0,0,0,0,0,0,0,0,0,0,0,0,0,0,0,0,0,0,0,0,0,0,0,0,0,0,0,0,0,0,0]
[null,{"$f":"IF(Plantilla!D9<>0,Plantilla!D9,\"\")","v":"Rui Costa"},null,null,null,null,null,null,null,null,null,null,null,null,null,null,null,null,null,null,null,null,null,null,null,null,null,null,null,null,null,null,null,null,null,null,null,null,null,null,null,null,null,null,null,null,null,null,null,null,null,null,null,null,null,0,0,"",0,0,0,0,0,0,0,0,0,0,0,0,0,0,0,0,0,0,0,0,0,0,0,0,0,0,0,0,0,0,0,0,0,0,0,0,0,0,0,0,0,0,0,0,0,0,0,0,0,0,0,0,0,0,0]
[null,{"$f":"IF(Plantilla!D10<>0,Plantilla!D10,\"\")","v":"Christopher Sutton"},null,null,null,null,null,null,null,null,null,null,null,null,null,null,null,null,null,null,null,null,null,null,null,null,null,null,null,null,null,null,null,null,null,null,null,null,null,null,null,null,null,null,null,null,null,null,null,null,null,null,null,null,null,0,0,"",0,0,0,0,0,0,0,0,0,0,0,0,0,0,0,0,0,0,0,0,0,0,0,0,0,0,0,0,0,0,0,0,0,0,0,0,0,0,0,0,0,0,0,0,0,0,0,0,0,0,0,0,0,0,0]
[null,{"$f":"IF(Plantilla!D11<>0,Plantilla!D11,\"\")","v":"Vladimir Karpets"},null,null,null,null,null,null,null,null,null,null,null,null,null,null,null,null,null,null,null,null,null,null,null,null,null,null,null,null,null,null,null,null,null,null,null,null,null,null,null,null,null,null,null,null,null,null,null,null,null,null,null,null,null,0,0,"",0,0,0,0,0,0,0,0,0,0,0,0,0,0,0,0,0,0,0,0,0,0,0,0,0,0,0,0,0,0,0,0,0,0,0,0,0,0,0,0,0,0,0,0,0,0,0,0,0,0,0,0,0,0,0]
[null,{"$f":"IF(Plantilla!D12<>0,Plantilla!D12,\"\")","v":"Julian Dean"},null,null,null,null,null,null,null,null,null,null,null,null,null,null,null,null,null,null,null,null,null,null,null,null,null,null,null,null,null,null,null,null,null,null,null,null,null,null,null,null,null,null,null,null,null,null,null,null,null,null,null,null,null,0,0,"",0,0,0,0,0,0,0,0,0,0,0,0,0,0,0,0,0,0,0,0,0,0,0,0,0,0,0,0,0,0,0,0,0,0,0,0,0,0,0,0,0,0,0,0,0,0,0,0,0,0,0,0,0,0,0]
[null,{"$f":"IF(Plantilla!D13<>0,Plantilla!D13,\"\")","v":"Andreas Klier"},null,null,null,null,null,null,null,null,null,null,null,null,null,null,null,null,null,null,null,null,null,null,null,null,null,null,null,null,null,null,null,null,null,null,null,null,null,null,null,null,null,null,null,null,null,null,null,null,null,null,null,null,null,0,0,"",0,0,0,0,0,0,0,0,0,0,0,0,0,0,0,0,0,0,0,0,0,0,0,0,0,0,0,0,0,0,0,0,0,0,0,0,0,0,0,0,0,0,0,0,0,0,0,0,0,0,0,0,0,0,0]
[null,{"$f":"IF(Plantilla!D14<>0,Plantilla!D14,\"\")","v":"Elia Viviani"},null,null,null,null,null,null,null,null,null,null,null,null,null,null,null,null,null,null,null,null,null,null,null,null,null,null,null,null,null,null,null,null,null,null,null,null,null,null,null,null,null,null,null,null,null,null,null,null,null,null,null,null,null,0,0,"",0,0,0,0,0,0,0,0,0,0,0,0,0,0,0,0,0,0,0,0,0,0,0,0,0,0,0,0,0,0,0,0,0,0,0,0,0,0,0,0,0,0,0,0,0,0,0,0,0,0,0,0,0,0,0]
[null,{"$f":"IF(Plantilla!D15<>0,Plantilla!D15,\"\")","v":"Daniel Navarro"},null,null,null,null,null,null,null,null,null,null,null,null,null,null,null,null,null,null,null,null,null,null,null,null,null,null,null,null,null,null,null,null,null,null,null,null,null,null,null,null,null,null,null,null,null,null,null,null,null,null,null,null,null,0,0,"",0,0,0,0,0,0,0,0,0,0,0,0,0,0,0,0,0,0,0,0,0,0,0,0,0,0,0,0,0,0,0,0,0,0,0,0,0,0,0,0,0,0,0,0,0,0,0,0,0,0,0,0,0,0,0]
[null,{"$f":"IF(Plantilla!D20<>0,Plantilla!D20,\"\")","v":"Jure Kocjan"},null,null,null,null,null,null,null,null,null,null,null,null,null,null,null,null,null,null,null,null,null,null,null,null,null,null,null,null,null,null,null,null,null,null,null,null,null,null,null,null,null,null,null,null,null,null,null,null,null,null,null,null,null,0,0,"",0,0,0,0,0,0,0,0,0,0,0,0,0,0,0,0,0,0,0,0,0,0,0,0,0,0,0,0,0,0,0,0,0,0,0,0,0,0,0,{"$f":"A16*AP$2","v":0},0,0,0,0,0,0,0,0,0,0,0,0,0,0,0]
[null,{"$f":"IF(Plantilla!D21<>0,Plantilla!D21,\"\")","v":"Przemyslaw Niemiec"},null,null,null,null,null,null,null,null,null,null,null,null,null,null,null,null,null,null,null,null,null,null,null,null,null,null,null,null,null,null,null,null,null,null,null,null,null,null,null,null,null,null,null,null,null,null,null,null,null,null,null,null,null,0,0,"",0,0,0,0,0,0,0,0,0,0,0,0,0,0,0,0,0,0,0,0,0,0,0,0,0,0,0,0,0,0,0,0,0,0,0,0,0,0,0,0,0,0,0,0,0,0,0,0,0,0,0,0,0,0,0]
[null,{"$f":"IF(Plantilla!D22<>0,Plantilla!D22,\"\")","v":"Sergio Paulinho"},null,null,null,null,null,null,null,null,null,null,null,null,null,null,null,null,null,null,null,null,null,null,null,null,null,null,null,null,null,null,null,null,null,null,null,null,null,null,null,null,null,null,null,null,null,null,null,null,null,null,null,null,null,0,0,"",0,0,0,0,0,0,0,0,0,0,0,0,0,0,0,0,0,0,0,0,0,0,0,0,0,0,0,0,0,0,0,0,0,0,0,0,0,0,0,0,0,0,0,0,0,0,0,0,0,0,0,0,0,0,0]
[null,{"$f":"IF(Plantilla!D19<>0,Plantilla!D19,\"\")","v":"Fabio Sabatini"},null,null,null,null,null,null,null,null,null,null,null,null,null,null,null,null,null,null,null,null,null,null,null,null,null,null,null,null,null,null,null,null,null,null,null,null,null,null,null,null,null,null,null,null,null,null,null,null,null,null,null,null,null,0,0,"",0,0,0,0,0,0,0,0,0,0,0,0,0,0,0,0,0,0,0,0,0,0,0,0,0,0,0,0,0,0,0,0,0,0,0,0,0,0,0,0,0,0,0,0,0,0,0,0,0,0,0,0,0,0,0]
[null,{"$f":"IF(Plantilla!D16<>0,Plantilla!D16,\"\")","v":"Johann Tschopp"},null,null,null,null,null,null,null,null,null,null,null,null,null,null,null,null,null,null,null,null,null,null,null,null,null,null,null,null,null,null,null,null,null,null,null,null,null,null,null,null,null,null,null,null,null,null,null,null,null,null,null,null,null,0,0,"",0,0,0,0,0,0,0,0,0,0,0,0,0,0,0,0,0,0,0,0,0,0,0,0,0,0,0,0,0,0,0,0,0,0,0,0,0,0,0,0,0,0,0,0,0,0,0,0,0,0,0,0,0,0,0]
[null,{"$f":"IF(Plantilla!D17<>0,Plantilla!D17,\"\")","v":"Miguel A. Ubeto"},null,null,null,null,null,null,null,null,null,null,null,null,null,null,null,null,null,null,null,null,null,null,null,null,null,null,null,null,null,null,null,null,null,null,null,null,null,null,null,null,null,null,null,null,null,null,null,null,null,null,null,null,null,0,0,"",0,0,0,0,0,0,0,0,0,0,0,0,0,0,0,0,0,0,0,0,0,{"$f":"X24*X$2","v":0},0,0,0,0,0,0,0,0,0,0,0,0,0,0,0,0,0,0,0,0,0,0,0,0,0,0,0,0,0,0,0,0,0]
[null,{"$f":"IF(Plantilla!D18<>0,Plantilla!D18,\"\")","v":"Tom-Jelte Slagter"},null,null,null,null,null,null,null,null,null,null,null,null,null,null,null,null,null,null,null,null,null,null,null,null,null,null,null,null,null,null,null,null,null,null,null,null,null,null,null,null,null,null,null,null,null,null,null,null,null,null,null,null,null,0,0,"",0,0,0,0,0,0,0,0,0,0,0,0,0,0,0,0,0,0,0,0,0,0,0,0,0,0,0,0,0,0,0,0,0,0,0,0,0,0,0,0,0,0,0,0,0,0,0,0,0,0,0,0,0,0,0]
[null,{"$f":"IF(Plantilla!D23<>0,Plantilla!D23,\"\")","v":""},null,null,null,null,null,null,null,null,null,null,null,null,null,null,null,null,null,null,null,null,null,null,null,null,null,null,null,null,null,null,null,null,null,null,null,null,null,null,null,null,null,null,null,null,null,null,null,null,null,null,null,null,null,0,0,"",0,0,0,0,0,0,0,0,0,0,0,0,0,0,0,0,0,0,0,0,0,0,0,0,0,0,0,0,0,0,0,0,0,0,0,0,0,0,0,0,0,0,0,0,0,0,0,0,0,0,0,0,0,0,0]
[null,{"$f":"IF(Plantilla!D24<>0,Plantilla!D24,\"\")","v":""},null,null,null,null,null,null,null,null,null,null,null,null,null,null,null,null,null,null,null,null,null,null,null,null,null,null,null,null,null,null,null,null,null,null,null,null,null,null,null,null,null,null,null,null,null,null,null,null,null,null,null,null,null,0,0,"",0,0,0,0,0,0,0,0,0,0,0,0,0,0,0,0,0,0,{"$f":"U27*U$2","v":0},0,0,0,0,0,0,0,0,0,0,0,0,0,0,0,0,0,0,0,0,0,0,0,0,0,0,0,0,0,0,0,0,0,0,0,0]
[null,{"$f":"IF(Plantilla!D25<>0,Plantilla!D25,\"\")","v":""},null,null,null,null,null,null,null,null,null,null,null,null,null,null,null,null,null,null,null,null,null,null,null,null,null,null,null,null,null,null,null,null,null,null,null,null,null,null,null,null,null,null,null,null,null,null,null,null,null,null,null,null,null,0,0,"",0,0,0,0,0,0,0,0,0,0,0,0,0,0,0,0,0,0,0,0,0,0,0,0,0,0,0,0,0,0,0,0,0,0,0,0,0,0,0,0,0,0,0,0,0,0,0,0,0,0,0,0,0,0,0]
[null,{"$f":"IF(Plantilla!D26<>0,Plantilla!D26,\"\")","v":""},null,null,null,null,null,null,null,null,null,null,null,null,null,null,null,null,null,null,null,null,null,null,null,null,null,null,null,null,null,null,null,null,null,null,null,null,null,null,null,null,null,null,null,null,null,null,null,null,null,null,null,null,null,0,0,"",0,0,0,0,0,0,0,0,0,0,0,0,0,0,0,0,0,0,0,0,0,0,0,0,0,0,0,0,0,0,0,0,0,0,0,0,0,0,0,0,0,0,0,0,0,0,0,0,0,0,0,0,0,0,0]
[null,{"$f":"IF(Plantilla!D27<>0,Plantilla!D27,\"\")","v":""},null,null,null,null,null,null,null,null,null,null,null,null,null,null,null,null,null,null,null,null,null,null,null,null,null,null,null,null,null,null,null,null,null,null,null,null,null,null,null,null,null,null,null,null,null,null,null,null,null,null,null,null,null,0,0,"",0,0,0,0,0,0,0,0,0,0,0,0,0,0,0,0,0,0,0,0,0,0,0,0,0,0,0,0,0,0,0,0,0,0,0,0,0,0,0,0,0,0,0,0,0,0,0,0,0,0,0,0,0,0,0]
[null,{"$f":"IF(Plantilla!D28<>0,Plantilla!D28,\"\")","v":""},null,null,null,null,null,null,null,null,null,null,null,null,null,null,null,null,null,null,null,null,null,null,null,null,null,null,null,null,null,null,null,null,null,null,null,null,null,null,null,null,null,null,null,null,null,null,null,null,null,null,null,null,null,0,0,"",0,0,0,0,0,0,0,0,0,0,0,0,0,0,0,0,0,0,0,0,0,0,0,0,0,0,0,0,0,0,0,0,0,0,0,0,0,0,0,0,0,0,0,0,0,0,0,0,0,0,0,0,0,0,0]
[null,{"$f":"IF(Plantilla!D29<>0,Plantilla!D29,\"\")","v":""},null,null,null,null,null,null,null,null,null,null,null,null,null,null,null,null,null,null,null,null,null,null,null,null,null,null,null,null,null,null,null,null,null,null,null,null,null,null,null,null,null,null,null,null,null,null,null,null,null,null,null,null,null,0,0,"",0,0,0,0,0,0,0,0,0,0,0,0,0,0,0,0,0,0,0,0,0,0,0,0,0,0,0,0,0,0,0,0,0,0,0,0,0,0,0,0,0,0,0,0,0,0,0,0,0,0,0,0,0,0,0]
[null,{"$f":"IF(Plantilla!D30<>0,Plantilla!D30,\"\")","v":""},null,null,null,null,null,null,null,null,null,null,null,null,null,null,null,null,null,null,null,null,null,null,null,null,null,null,null,null,null,null,null,null,null,null,null,null,null,null,null,null,null,null,null,null,null,null,null,null,null,null,null,null,null,0,0,"",0,0,0,0,0,0,0,0,0,0,0,0,0,0,0,0,0,0,0,0,0,0,0,0,0,0,0,0,0,0,0,0,0,0,0,0,0,0,0,0,0,0,0,0,0,0,0,0,0,0,0,0,0,0,0]
[null,{"$f":"IF(Plantilla!D31<>0,Plantilla!D31,\"\")","v":""},null,null,null,null,null,null,null,null,null,null,null,null,null,null,null,null,null,null,null,null,null,null,null,null,null,null,null,null,null,null,null,null,null,null,null,null,null,null,null,null,null,null,null,null,null,null,null,null,null,null,null,null,null,0,0,"",0,0,0,0,0,0,0,0,0,0,0,0,0,0,0,0,0,0,0,0,0,0,0,0,0,0,0,0,0,0,0,0,0,0,0,0,0,0,0,0,0,0,0,0,0,0,0,0,0,0,0,0,0,0,0]
[null,{"$f":"IF(Plantilla!D32<>0,Plantilla!D32,\"\")","v":""},null,null,null,null,null,null,null,null,null,null,null,null,null,null,null,null,null,null,null,null,null,null,null,null,null,null,null,null,null,null,null,null,null,null,null,null,null,null,null,null,null,null,null,null,null,null,null,null,null,null,null,null,null,0,0,"",0,0,0,0,0,0,0,0,0,0,0,0,0,0,0,0,0,0,0,0,0,0,0,0,0,0,0,0,0,0,0,0,0,0,0,0,0,0,0,0,0,0,0,0,0,0,0,0,0,0,0,0,0,0,0]
[null,{"$f":"IF(Plantilla!D33<>0,Plantilla!D33,\"\")","v":""},null,null,null,null,null,null,null,null,null,null,null,null,null,null,null,null,null,null,null,null,null,null,null,null,null,null,null,null,null,null,null,null,null,null,null,null,null,null,null,null,null,null,null,null,null,null,null,null,null,null,null,null,null,0,0,"",0,0,0,0,0,0,0,0,0,0,0,0,0,0,0,0,0,0,0,0,0,0,0,0,0,0,0,0,0,0,0,0,0,0,0,0,0,0,0,0,0,0,0,0,0,0,0,0,0,0,0,0,0,0,0]
[null,{"$f":"'Consulta Corredor'!B2","v":"Samuel Sánchez"},{"$f":"INDEX(C6:C36,MATCH($B$37,corredores,0))","v":0},0,0,0,0,0,0,0,0,0,0,0,0,0,0,0,0,0,0,0,0,0,0,0,0,0,0,0,0,0,0,0,{"$f":"INDEX(AI6:AI36,MATCH($B$37,corredores,0))","v":0},0,0,0,0,0,0,0,0,0,0,0,0,0,0,0,0,0,0,0,0,0]
[null,null,{"$f":"IF(C37=1,C1,\"\")","v":""},"","","","","","","","","","","","","","","","","","","","","","","","","","","","","","","",{"$f":"IF(AI37=1,AI1,\"\")","v":""},"","","","","","","","","","","","","","","","","","","","",0]
[null,null,{"$f":"IF(C37=1,C2,\"\")","v":""},"","","","","","","","","","","","","","","","","","","","","","","","","","","","","","","",{"$f":"IF(AI37=1,AI2,\"\")","v":""},"","","","","","","","","","","","","","","","","","","","",0]
[null,{"$f":"IF(Plantilla!C36<>0,Plantilla!C36,\"\")","v":"Totales"},{"$f":"SUM(C6:C36)","v":0},{"$f":"SUM(D6:D36)","v":0},0,0,0,0,0,0,0,0,0,0,0,0,0,0,0,0,0,0,0,0,0,0,0,0,0,0,{"$f":"SUM(AE6:AE36)","v":0},0,0,0,0,0,0,0,0,0,0,0,{"$f":"SUM(AQ6:AQ36)","v":0},0,0,0,0,0,0,0,0,0,0,0,0,0,null,null,"Numero de carreras:",null,null,null,54,null,null,null,null,null,null,null,null,null,null,null,null,null,null,null,null,null,null,null,null,null,null,null,null,null,null,null,null,null,null,null,null,null,null,null,null,null,null,null,null,null,null,null,null,null,null,null,null,null,{"$f":"SUM(C40:BD40)","v":0}]
[null,"Gastos",{"$f":"IF(C40<>0,C5,0)","v":0},0,0,0,0,0,0,0,0,0,0,0,0,0,0,0,0,0,0,0,0,0,0,0,0,0,0,0,0,0,0,0,{"$f":"IF(AI40<>0,AI5,0)","v":0},0,0,0,0,0,0,0,0,0,0,0,0,0,0,0,0,0,0,0,0,0,null,null,null,null,null,null,null,null,null,null,null,null,null,null,null,null,null,null,null,null,null,null,null,null,null,null,null,null,null,null,null,null,null,null,null,null,null,null,null,null,null,null,null,null,null,null,null,null,null,null,null,null,null,null,null,null,{"$f":"SUM(C41:BD41)","v":0}]
[null,{"$f":"IF(Plantilla!D38<>0,Plantilla!D38,\"\")","v":""}]

{"sheet":"General","index":7,"n_rows":42,"n_cols":169,"rows_kept":42,"cut":false,"hidden":false,"merged":[[4,168,5,168],[40,114,40,117]]}
[]
[null,null,{"$f":"Inscripciones!C1","v":"Campeonatos Nacionales ITT"},{"$f":"Inscripciones!D1","v":"Campeonatos Nacionales RR"},{"$f":"Inscripciones!E1","v":"Santos Tour Down Under"},{"$f":"Inscripciones!F1","v":"Milán-San Remo"},{"$f":"Inscripciones!G1","v":"Omloop"},{"$f":"Inscripciones!H1","v":"Tour de Flandres"},{"$f":"Inscripciones!I1","v":"E3 Prijs Vlaanderen-Harelbeke"},{"$f":"Inscripciones!J1","v":"Gent-Wevelgem"},{"$f":"Inscripciones!K1","v":"Paris-Roubaix"},{"$f":"Inscripciones!L1","v":"Strade Bianche"},{"$f":"Inscripciones!M1","v":"Paris-Niza"},{"$f":"Inscripciones!N1","v":"Amstel Gold Race"},{"$f":"Inscripciones!O1","v":"Flecha Valona"},{"$f":"Inscripciones!P1","v":"Lieja-Bastoña-Lieja"},{"$f":"Inscripciones!Q1","v":"Dauphiné Libéré"},{"$f":"Inscripciones!R1","v":"Tour de France"},{"$f":"Inscripciones!S1","v":"Chrono des Nations"},{"$f":"Inscripciones!T1","v":"GP du Québec"},{"$f":"Inscripciones!U1","v":"Vuelta al País Vasco"},{"$f":"Inscripciones!V1","v":"Critérium International"},{"$f":"Inscripciones!W1","v":"Hamburguer Turn"},{"$f":"Inscripciones!X1","v":"GP de Montréal"},{"$f":"Inscripciones!Y1","v":"GP de Lombardía"},{"$f":"Inscripciones!Z1","v":"Clásica San Sebastián"},{"$f":"Inscripciones!AA1","v":"Campeonatos del Mundo: Contrarreloj por Equipos"},{"$f":"Inscripciones!AB1","v":"Campeonatos del Mundo: Contrarreloj Individual "},{"$f":"Inscripciones!AC1","v":"Campeonatos del Mundo en Ruta"},"Paris-Roubaix (1 Día) -- GC","Grand Prix Cycliste de Montreal (1 Dia) -- TC","Ronde van Drenthe (1 Dia) -- PC","Vuelta a Burgos (5 Dias) -- PV","Paris - Bruxelles (1 Dia) -- TC","CN Sur de Europa: Contrarreloj Individual (1 Dia) CN","CN Este de Europa: Contrarreloj Individual (1 Dia) CN","CN Norte de Europa: Contrarreloj Individual (1 Dia) CN","CN America: Contrarreloj Individual (1 Dia) CN","CN Resto del Mundo: Contrarreloj Individual (1 Dia) CN","CN Sur de Europa: Ruta en Carretera (1 Dia) CN","CN Este de Europa: Ruta en Carretera (1 Dia) CN","CN Norte de Europa: Ruta en Carretera (1 Dia) CN","CN America: Ruta en Carretera (1 Dia) CN","CN Resto del Mundo: Ruta en Carretera (1 Dia) CN","Milano - Torino (1 Dia) -- TC","Il Lombardía - Clasica de Lombardia (1 Día) -- GC","Vuelta españa (21 Dias) -- GV","Flèche Brabançonne (1 Día) -- TC","Giro del Trentino (4 Dias) -- PV","Tour of Beijing (5 Dias) -- TV","Chrono des Nations (1 Día) -- PC","Japan Cup (1 Dia) -- PC","Gante-Wevelgen (1 Día) -- MC","Campeonatos del Mundo: Contrarreloj por Equipos (1 Día) -- MCE","Campeonatos del Mundo: Contrarreloj Individual (1 Día) -- MCI","Campeonatos del Mundo: Ruta en Carretera (1 Día) -- MRC",null,{"$f":"'Consulta de Inscripciones'!B2","v":"Santos Tour Down Under"},null,{"$f":"C2","v":"Campeonatos Nacionales ITT"},"Campeonatos Nacionales RR","Santos Tour Down Under","Milán-San Remo","Omloop","Tour de Flandres","E3 Prijs Vlaanderen-Harelbeke","Gent-Wevelgem","Paris-Roubaix","Strade Bianche","Paris-Niza","Amstel Gold Race","Flecha Valona","Lieja-Bastoña-Lieja","Dauphiné Libéré","Tour de France","Chrono des Nations","GP du Québec","Vuelta al País Vasco","Critérium International","Hamburguer Turn","GP de Montréal","GP de Lombardía","Clásica San Sebastián","Campeonatos del Mundo: Contrarreloj por Equipos","Campeonatos del Mundo: Contrarreloj Individual ","Campeonatos del Mundo en Ruta","Paris-Roubaix (1 Día) -- GC","Grand Prix Cycliste de Montreal (1 Dia) -- TC","Ronde van Drenthe (1 Dia) -- PC","Vuelta a Burgos (5 Dias) -- PV","Paris - Bruxelles (1 Dia) -- TC",{"$f":"AI2","v":"CN Sur de Europa: Contrarreloj Individual (1 Dia) CN"},"CN Este de Europa: Contrarreloj Individual (1 Dia) CN","CN Norte de Europa: Contrarreloj Individual (1 Dia) CN","CN America: Contrarreloj Individual (1 Dia) CN","CN Resto del Mundo: Contrarreloj Individual (1 Dia) CN","CN Sur de Europa: Ruta en Carretera (1 Dia) CN","CN Este de Europa: Ruta en Carretera (1 Dia) CN","CN Norte de Europa: Ruta en Carretera (1 Dia) CN","CN America: Ruta en Carretera (1 Dia) CN","CN Resto del Mundo: Ruta en Carretera (1 Dia) CN","Milano - Torino (1 Dia) -- TC","Il Lombardía - Clasica de Lombardia (1 Día) -- GC","Vuelta españa (21 Dias) -- GV","Flèche Brabançonne (1 Día) -- TC","Giro del Trentino (4 Dias) -- PV","Tour of Beijing (5 Dias) -- TV","Chrono des Nations (1 Día) -- PC","Japan Cup (1 Dia) -- PC","Gante-Wevelgen (1 Día) -- MC","Campeonatos del Mundo: Contrarreloj por Equipos (1 Día) -- MCE","Campeonatos del Mundo: Contrarreloj Individual (1 Día) -- MCI","Campeonatos del Mundo: Ruta en Carretera (1 Día) -- MRC",null,{"$f":"C2","v":"Campeonatos Nacionales ITT"},"Campeonatos Nacionales RR","Santos Tour Down Under","Milán-San Remo","Omloop","Tour de Flandres","E3 Prijs Vlaanderen-Harelbeke","Gent-Wevelgem","Paris-Roubaix","Strade Bianche","Paris-Niza","Amstel Gold Race","Flecha Valona","Lieja-Bastoña-Lieja","Dauphiné Libéré","Tour de France","Chrono des Nations","GP du Québec","Vuelta al País Vasco","Critérium International","Hamburguer Turn","GP de Montréal","GP de Lombardía","Clásica San Sebastián","Campeonatos del Mundo: Contrarreloj por Equipos","Campeonatos del Mundo: Contrarreloj Individual ","Campeonatos del Mundo en Ruta","Paris-Roubaix (1 Día) -- GC","Grand Prix Cycliste de Montreal (1 Dia) -- TC","Ronde van Drenthe (1 Dia) -- PC","Vuelta a Burgos (5 Dias) -- PV","Paris - Bruxelles (1 Dia) -- TC",{"$f":"AI2","v":"CN Sur de Europa: Contrarreloj Individual (1 Dia) CN"},"CN Este de Europa: Contrarreloj Individual (1 Dia) CN","CN Norte de Europa: Contrarreloj Individual (1 Dia) CN","CN America: Contrarreloj Individual (1 Dia) CN","CN Resto del Mundo: Contrarreloj Individual (1 Dia) CN","CN Sur de Europa: Ruta en Carretera (1 Dia) CN","CN Este de Europa: Ruta en Carretera (1 Dia) CN","CN Norte de Europa: Ruta en Carretera (1 Dia) CN","CN America: Ruta en Carretera (1 Dia) CN","CN Resto del Mundo: Ruta en Carretera (1 Dia) CN","Milano - Torino (1 Dia) -- TC","Il Lombardía - Clasica de Lombardia (1 Día) -- GC","Vuelta españa (21 Dias) -- GV","Flèche Brabançonne (1 Día) -- TC","Giro del Trentino (4 Dias) -- PV","Tour of Beijing (5 Dias) -- TV","Chrono des Nations (1 Día) -- PC","Japan Cup (1 Dia) -- PC","Gante-Wevelgen (1 Día) -- MC","Campeonatos del Mundo: Contrarreloj por Equipos (1 Día) -- MCE","Campeonatos del Mundo: Contrarreloj Individual (1 Día) -- MCI","Campeonatos del Mundo: Ruta en Carretera (1 Día) -- MRC"]
[null,"Días",{"$f":"Inscripciones!C2","v":1},{"$f":"Inscripciones!D2","v":1},{"$f":"Inscripciones!E2","v":6},{"$f":"Inscripciones!F2","v":1},{"$f":"Inscripciones!G2","v":1},{"$f":"Inscripciones!H2","v":1},{"$f":"Inscripciones!I2","v":1},{"$f":"Inscripciones!J2","v":1},{"$f":"Inscripciones!K2","v":1},{"$f":"Inscripciones!L2","v":1},{"$f":"Inscripciones!M2","v":8},{"$f":"Inscripciones!N2","v":1},{"$f":"Inscripciones!O2","v":1},{"$f":"Inscripciones!P2","v":1},{"$f":"Inscripciones!Q2","v":8},{"$f":"Inscripciones!R2","v":21},{"$f":"Inscripciones!S2","v":1},{"$f":"Inscripciones!T2","v":1},{"$f":"Inscripciones!U2","v":6},{"$f":"Inscripciones!V2","v":3},{"$f":"Inscripciones!W2","v":1},{"$f":"Inscripciones!X2","v":1},{"$f":"Inscripciones!Y2","v":1},{"$f":"Inscripciones!Z2","v":1},{"$f":"Inscripciones!AA2","v":1},{"$f":"Inscripciones!AB2","v":1},{"$f":"Inscripciones!AC2","v":1},1,1,1,5,1,1,1,1,1,1,1,1,1,1,1,1,1,21,1,4,5,1,1,1,1,1,1]
[null,"Mes",{"$f":"Inscripciones!C3","v":"Ag"},{"$f":"Inscripciones!D3","v":"Ag"},{"$f":"Inscripciones!G3","v":"Ag"},{"$f":"Inscripciones!H3","v":"Ag"},{"$f":"Inscripciones!I3","v":"Ag"},{"$f":"Inscripciones!J3","v":"Ag"},{"$f":"Inscripciones!K3","v":"Ag"},{"$f":"Inscripciones!L3","v":"Ag"},{"$f":"Inscripciones!M3","v":"S"},{"$f":"Inscripciones!N3","v":"S"},{"$f":"Inscripciones!O3","v":"S"},{"$f":"Inscripciones!P3","v":"S"},{"$f":"Inscripciones!Q3","v":"S"},{"$f":"Inscripciones!R3","v":"O"},{"$f":"Inscripciones!S3","v":"O"},{"$f":"Inscripciones!T3","v":"O"},{"$f":"Inscripciones!U3","v":"O"},{"$f":"Inscripciones!V3","v":"O"},{"$f":"Inscripciones!W3","v":"O"},{"$f":"Inscripciones!X3","v":"O"},{"$f":"Inscripciones!Y3","v":"O"},{"$f":"Inscripciones!Z3","v":"N"},{"$f":"Inscripciones!AA3","v":"N"},{"$f":"Inscripciones!AC3","v":"N"},{"$f":"Inscripciones!AD3","v":0},{"$f":"Inscripciones!AE3","v":"My"},{"$f":"Inscripciones!AF3","v":"My"},"My","My","My","My","My","My","My","My","My","My","My","My","My","My","My","My","My","J","J","J","J","J","J","J","J","J","J",null,"J","J",null,null,null,null,null,null,null,null,null,null,null,null,null,null,null,null,null,null,null,null,null,null,null,null,null,null,null,null,null,null,null,null,null,null,null,null,null,null,null,null,null,null,null,null,null,null,null,null,null,null,null,null,null,null,null,"J","J","J","J","J","J","J","J","J","J","J","J","J","J","J","J","J","J","J","J","J","J","J","J","J","J","J","J","J","J","J","J","J","J","J","J","J","J","J","J","J","J","J","J","J","J","J","J","J","J","J","J","J","J","Códigos"]
[null,"Tipo",{"$f":"Inscripciones!C4","v":0},{"$f":"Inscripciones!D4","v":0},{"$f":"Inscripciones!E4","v":"2.HC"},{"$f":"Inscripciones!F4","v":"1.UWT"},{"$f":"Inscripciones!G4","v":1.1000000000000001},{"$f":"Inscripciones!H4","v":"1.UWT"},{"$f":"Inscripciones!I4","v":"1.HC"},{"$f":"Inscripciones!J4","v":"1.HC"},{"$f":"Inscripciones!K4","v":"1.UWT"},{"$f":"Inscripciones!L4","v":1.1000000000000001},{"$f":"Inscripciones!M4","v":"2.UWT"},{"$f":"Inscripciones!N4","v":"1.HC"},{"$f":"Inscripciones!O4","v":"1.HC"},{"$f":"Inscripciones!P4","v":"1.UWT"},{"$f":"Inscripciones!Q4","v":"2.UWT"},{"$f":"Inscripciones!R4","v":"GV"},{"$f":"Inscripciones!S4","v":1.1000000000000001},{"$f":"Inscripciones!T4","v":1.1000000000000001},{"$f":"Inscripciones!U4","v":"2.HC"},{"$f":"Inscripciones!V4","v":2.1},{"$f":"Inscripciones!W4","v":1.1000000000000001},{"$f":"Inscripciones!X4","v":"1.HC"},{"$f":"Inscripciones!Y4","v":"1.UWT"},{"$f":"Inscripciones!Z4","v":"1.HC"},{"$f":"Inscripciones!AA4","v":"WC TTT"},{"$f":"Inscripciones!AB4","v":"WC ITT"},{"$f":"Inscripciones!AC4","v":"WC RR"},"TC","TC","PC","PV","TC","CN","CN","CN","CN","CN","CN","CN","CN","CN","CN","TC","GC","GV","TC","PV","TV","PC","PC","MC","MCE","MCI","MRC",null,null,null,null,null,null,null,null,null,null,null,null,null,null,null,null,null,null,null,null,null,null,null,null,null,null,null,null,null,null,null,null,null,null,null,null,null,null,null,null,null,null,null,null,null,null,null,null,null,null,null,null,null,null,null,null,null,null,{"$f":"C5","v":0},0,"2.HC","1.UWT",1.1000000000000001,"1.UWT","1.HC","1.HC","1.UWT",1.1000000000000001,"2.UWT","1.HC","1.HC","1.UWT","2.UWT","GV",1.1000000000000001,1.1000000000000001,"2.HC",2.1,1.1000000000000001,"1.HC","1.UWT","1.HC","WC TTT","WC ITT","WC RR","TC","TC","PC","PV","TC",{"$f":"AI5","v":"CN"},"CN","CN","CN","CN","CN","CN","CN","CN","CN","TC","GC","GV","TC","PV","TV","PC","PC","MC","MCE","MCI","MRC","Cambiar los premios"]
[null,"Precio",{"$f":"Inscripciones!C5","v":0},{"$f":"Inscripciones!D5","v":0},{"$f":"Inscripciones!E5","v":8000},{"$f":"Inscripciones!F5","v":8000},{"$f":"Inscripciones!G5","v":1200},{"$f":"Inscripciones!H5","v":8000},{"$f":"Inscripciones!I5","v":4800},{"$f":"Inscripciones!J5","v":4800},{"$f":"Inscripciones!K5","v":8000},{"$f":"Inscripciones!L5","v":1200},{"$f":"Inscripciones!M5","v":8000},{"$f":"Inscripciones!N5","v":4800},{"$f":"Inscripciones!O5","v":4800},{"$f":"Inscripciones!P5","v":8000},{"$f":"Inscripciones!Q5","v":8000},{"$f":"Inscripciones!R5","v":100000},{"$f":"Inscripciones!S5","v":1200},{"$f":"Inscripciones!T5","v":1200},{"$f":"Inscripciones!U5","v":8000},{"$f":"Inscripciones!V5","v":1600},{"$f":"Inscripciones!W5","v":1200},{"$f":"Inscripciones!X5","v":4800},{"$f":"Inscripciones!Y5","v":8000},{"$f":"Inscripciones!Z5","v":4800},{"$f":"Inscripciones!AA5","v":2000},{"$f":"Inscripciones!AB5","v":2000},{"$f":"Inscripciones!AC5","v":6000},{"$f":"LOOKUP(AD5,Categorias,Precios)","v":6000},6000,6000,6000,6000,8000,8000,8000,8000,8000,8000,8000,8000,8000,8000,6000,8000,100000,6000,6000,6000,6000,6000,6000,6000,6000,6000]
[null,{"$f":"IF(Plantilla!D3<>0,Plantilla!D3,\"\")","v":"Vincenzo Nibali"},null,null,null,null,null,null,null,null,null,null,null,null,null,null,null,null,null,null,null,null,null,null,null,null,null,null,null,null,null,null,null,null,null,null,null,null,null,null,null,null,null,null,null,null,null,null,null,null,null,null,null,null,null,null,null,{"$f":"INDIRECT(ADDRESS(ROW(),MATCH($BF$2,carreras,0)+1))","v":0},{"$f":"IF(BF7=1,B7,\"\")","v":""},{"$f":"IFERROR(INDEX(general,MATCH(DK7,ranking_premios,0)),0)","v":0},{"$f":"IFERROR(INDEX(general,MATCH(DL7,ranking_premios,0)),0)","v":0},{"$f":"IFERROR(INDEX(general,MATCH(DM7,ranking_premios,0)),0)","v":0},{"$f":"IFERROR(INDEX(general,MATCH(DN7,ranking_premios,0)),0)","v":0},{"$f":"IFERROR(INDEX(general,MATCH(DO7,ranking_premios,0)),0)","v":0},{"$f":"IFERROR(INDEX(general,MATCH(DP7,ranking_premios,0)),0)","v":0},{"$f":"IFERROR(INDEX(general,MATCH(DQ7,ranking_premios,0)),0)","v":0},{"$f":"IFERROR(INDEX(general,MATCH(DR7,ranking_premios,0)),0)","v":0},{"$f":"IFERROR(INDEX(general,MATCH(DS7,ranking_premios,0)),0)","v":0},{"$f":"IFERROR(INDEX(general,MATCH(DT7,ranking_premios,0)),0)","v":0},{"$f":"IFERROR(INDEX(general,MATCH(DU7,ranking_premios,0)),0)","v":0},{"$f":"IFERROR(INDEX(general,MATCH(DV7,ranking_premios,0)),0)","v":0},{"$f":"IFERROR(INDEX(general,MATCH(DW7,ranking_premios,0)),0)","v":0},{"$f":"IFERROR(INDEX(general,MATCH(DX7,ranking_premios,0)),0)","v":0},{"$f":"IFERROR(INDEX(general,MATCH(DY7,ranking_premios,0)),0)","v":0},{"$f":"IFERROR(INDEX(general,MATCH(DZ7,ranking_premios,0)),0)","v":0},{"$f":"IFERROR(INDEX(general,MATCH(EA7,ranking_premios,0)),0)","v":0},{"$f":"IFERROR(INDEX(general,MATCH(EB7,ranking_premios,0)),0)","v":0},{"$f":"IFERROR(INDEX(general,MATCH(EC7,ranking_premios,0)),0)","v":0},{"$f":"IFERROR(INDEX(general,MATCH(ED7,ranking_premios,0)),0)","v":0},{"$f":"IFERROR(INDEX(general,MATCH(EE7,ranking_premios,0)),0)","v":0},{"$f":"IFERROR(INDEX(general,MATCH(EF7,ranking_premios,0)),0)","v":0},{"$f":"IFERROR(INDEX(general,MATCH(EG7,ranking_premios,0)),0)","v":0},{"$f":"IFERROR(INDEX(general,MATCH(EH7,ranking_premios,0)),0)","v":0},{"$f":"IFERROR(INDEX(general,MATCH(EI7,ranking_premios,0)),0)","v":0},{"$f":"IFERROR(INDEX(general,MATCH(EJ7,ranking_premios,0)),0)","v":0},{"$f":"IFERROR(INDEX(general,MATCH(EK7,ranking_premios,0)),0)","v":0},{"$f":"IFERROR(INDEX(general,MATCH(EL7,ranking_premios,0)),0)","v":0},{"$f":"IFERROR(INDEX(general,MATCH(EM7,ranking_premios,0)),0)","v":0},{"$f":"IFERROR(INDEX(general,MATCH(EN7,ranking_premios,0)),0)","v":0},{"$f":"IFERROR(INDEX(general,MATCH(EO7,ranking_premios,0)),0)","v":0},{"$f":"IFERROR(INDEX(general,MATCH(EP7,ranking_premios,0)),0)","v":0},{"$f":"IFERROR(INDEX(general,MATCH(EQ7,ranking_premios,0)),0)","v":0},{"$f":"IFERROR(INDEX(general,MATCH(ER7,ranking_premios,0)),0)","v":0},{"$f":"IFERROR(INDEX(general,MATCH(ES7,ranking_premios,0)),0)","v":0},{"$f":"IFERROR(INDEX(general,MATCH(ET7,ranking_premios,0)),0)","v":0},{"$f":"IFERROR(INDEX(general,MATCH(EU7,ranking_premios,0)),0)","v":0},{"$f":"IFERROR(INDEX(general,MATCH(EV7,ranking_premios,0)),0)","v":0},{"$f":"IFERROR(INDEX(general,MATCH(EW7,ranking_premios,0)),0)","v":0},{"$f":"IFERROR(INDEX(general,MATCH(EX7,ranking_premios,0)),0)","v":0},{"$f":"IFERROR(INDEX(general,MATCH(EY7,ranking_premios,0)),0)","v":0},{"$f":"IFERROR(INDEX(general,MATCH(EZ7,ranking_premios,0)),0)","v":0},{"$f":"IFERROR(INDEX(general,MATCH(FA7,ranking_premios,0)),0)","v":0},{"$f":"IFERROR(INDEX(general,MATCH(FB7,ranking_premios,0)),0)","v":0},{"$f":"IFERROR(INDEX(general,MATCH(FC7,ranking_premios,0)),0)","v":0},{"$f":"IFERROR(INDEX(general,MATCH(FD7,ranking_premios,0)),0)","v":0},{"$f":"IFERROR(INDEX(general,MATCH(FE7,ranking_premios,0)),0)","v":0},{"$f":"IFERROR(INDEX(general,MATCH(FF7,ranking_premios,0)),0)","v":0},{"$f":"IFERROR(INDEX(general,MATCH(FG7,ranking_premios,0)),0)","v":0},{"$f":"IFERROR(INDEX(general,MATCH(FH7,ranking_premios,0)),0)","v":0},{"$f":"IFERROR(INDEX(general,MATCH(FI7,ranking_premios,0)),0)","v":0},{"$f":"IFERROR(INDEX(general,MATCH(FJ7,ranking_premios,0)),0)","v":0},{"$f":"IFERROR(INDEX(general,MATCH(FK7,ranking_premios,0)),0)","v":0},{"$f":"IFERROR(INDEX(general,MATCH(FL7,ranking_premios,0)),0)","v":0},null,{"$f":"IF(C7<>\"\",CONCATENATE(DK$5,\" \",C7,\"\"))","v":false},false,false,false,false,false,false,false,false,false,false,false,false,false,false,false,{"$f":"IF(S7<>\"\",CONCATENATE(EA$5,\" \",S7,\"\"))","v":false},{"$f":"IF(T7<>\"\",CONCATENATE(EB$5,\" \",T7,\"\"))","v":false},false,false,false,false,false,false,false,false,false,false,false,false,false,false,false,false,false,false,false,false,false,false,false,false,false,false,false,false,false,false,false,false,false,false,false,false,{"$f":"SUM(BH7:CH7)","v":0}]
[null,{"$f":"IF(Plantilla!D4<>0,Plantilla!D4,\"\")","v":"Samuel Sánchez"},null,null,null,null,null,null,null,null,null,null,null,null,null,null,null,null,null,null,null,null,null,null,null,null,null,null,null,null,null,null,null,null,null,null,null,null,null,null,null,null,null,null,null,null,null,null,null,null,null,null,null,null,null,null,null,{"$f":"INDIRECT(ADDRESS(ROW(),MATCH($BF$2,carreras,0)+1))","v":0},"",0,0,{"$f":"IFERROR(INDEX(general,MATCH(DM8,ranking_premios,0)),0)","v":0},0,0,0,0,0,0,0,0,0,0,0,0,0,0,0,0,0,0,0,0,0,0,0,0,0,0,0,0,0,0,0,0,0,0,0,0,0,0,0,0,0,0,0,0,0,0,0,0,0,0,0,null,{"$f":"IF(C8<>\"\",CONCATENATE(DK$5,\" \",C8,\"\"))","v":false},{"$f":"IF(D8<>\"\",CONCATENATE(DL$5,\" \",D8,\"\"))","v":false},{"$f":"IF(E8<>\"\",CONCATENATE(DM$5,\" \",E8,\"\"))","v":false},{"$f":"IF(F8<>\"\",CONCATENATE(DN$5,\" \",F8,\"\"))","v":false},{"$f":"IF(G8<>\"\",CONCATENATE(DO$5,\" \",G8,\"\"))","v":false},{"$f":"IF(H8<>\"\",CONCATENATE(DP$5,\" \",H8,\"\"))","v":false},{"$f":"IF(I8<>\"\",CONCATENATE(DQ$5,\" \",I8,\"\"))","v":false},{"$f":"IF(J8<>\"\",CONCATENATE(DR$5,\" \",J8,\"\"))","v":false},{"$f":"IF(K8<>\"\",CONCATENATE(DS$5,\" \",K8,\"\"))","v":false},{"$f":"IF(L8<>\"\",CONCATENATE(DT$5,\" \",L8,\"\"))","v":false},{"$f":"IF(M8<>\"\",CONCATENATE(DU$5,\" \",M8,\"\"))","v":false},{"$f":"IF(N8<>\"\",CONCATENATE(DV$5,\" \",N8,\"\"))","v":false},{"$f":"IF(O8<>\"\",CONCATENATE(DW$5,\" \",O8,\"\"))","v":false},{"$f":"IF(P8<>\"\",CONCATENATE(DX$5,\" \",P8,\"\"))","v":false},{"$f":"IF(Q8<>\"\",CONCATENATE(DY$5,\" \",Q8,\"\"))","v":false},{"$f":"IF(R8<>\"\",CONCATENATE(DZ$5,\" \",R8,\"\"))","v":false},{"$f":"IF(S8<>\"\",CONCATENATE(EA$5,\" \",S8,\"\"))","v":false},{"$f":"IF(T8<>\"\",CONCATENATE(EB$5,\" \",T8,\"\"))","v":false},{"$f":"IF(U8<>\"\",CONCATENATE(EC$5,\" \",U8,\"\"))","v":false},{"$f":"IF(V8<>\"\",CONCATENATE(ED$5,\" \",V8,\"\"))","v":false},{"$f":"IF(W8<>\"\",CONCATENATE(EE$5,\" \",W8,\"\"))","v":false},{"$f":"IF(X8<>\"\",CONCATENATE(EF$5,\" \",X8,\"\"))","v":false},{"$f":"IF(Y8<>\"\",CONCATENATE(EG$5,\" \",Y8,\"\"))","v":false},{"$f":"IF(Z8<>\"\",CONCATENATE(EH$5,\" \",Z8,\"\"))","v":false},{"$f":"IF(AA8<>\"\",CONCATENATE(EI$5,\" \",AA8,\"\"))","v":false},{"$f":"IF(AB8<>\"\",CONCATENATE(EJ$5,\" \",AB8,\"\"))","v":false},{"$f":"IF(AC8<>\"\",CONCATENATE(EK$5,\" \",AC8,\"\"))","v":false},{"$f":"IF(AD8<>\"\",CONCATENATE(EL$5,\" \",AD8,\"\"))","v":false},{"$f":"IF(AE8<>\"\",CONCATENATE(EM$5,\" \",AE8,\"\"))","v":false},{"$f":"IF(AF8<>\"\",CONCATENATE(EN$5,\" \",AF8,\"\"))","v":false},{"$f":"IF(AG8<>\"\",CONCATENATE(EO$5,\" \",AG8,\"\"))","v":false},{"$f":"IF(AH8<>\"\",CONCATENATE(EP$5,\" \",AH8,\"\"))","v":false},{"$f":"IF(AI8<>\"\",CONCATENATE(EQ$5,\" \",AI8,\"\"))","v":false},{"$f":"IF(AJ8<>\"\",CONCATENATE(ER$5,\" \",AJ8,\"\"))","v":false},{"$f":"IF(AK8<>\"\",CONCATENATE(ES$5,\" \",AK8,\"\"))","v":false},{"$f":"IF(AL8<>\"\",CONCATENATE(ET$5,\" \",AL8,\"\"))","v":false},{"$f":"IF(AM8<>\"\",CONCATENATE(EU$5,\" \",AM8,\"\"))","v":false},{"$f":"IF(AN8<>\"\",CONCATENATE(EV$5,\" \",AN8,\"\"))","v":false},{"$f":"IF(AO8<>\"\",CONCATENATE(EW$5,\" \",AO8,\"\"))","v":false},{"$f":"IF(AP8<>\"\",CONCATENATE(EX$5,\" \",AP8,\"\"))","v":false},{"$f":"IF(AQ8<>\"\",CONCATENATE(EY$5,\" \",AQ8,\"\"))","v":false},{"$f":"IF(AR8<>\"\",CONCATENATE(EZ$5,\" \",AR8,\"\"))","v":false},{"$f":"IF(AS8<>\"\",CONCATENATE(FA$5,\" \",AS8,\"\"))","v":false},{"$f":"IF(AT8<>\"\",CONCATENATE(FB$5,\" \",AT8,\"\"))","v":false},{"$f":"IF(AU8<>\"\",CONCATENATE(FC$5,\" \",AU8,\"\"))","v":false},{"$f":"IF(AV8<>\"\",CONCATENATE(FD$5,\" \",AV8,\"\"))","v":false},{"$f":"IF(AW8<>\"\",CONCATENATE(FE$5,\" \",AW8,\"\"))","v":false},{"$f":"IF(AX8<>\"\",CONCATENATE(FF$5,\" \",AX8,\"\"))","v":false},{"$f":"IF(AY8<>\"\",CONCATENATE(FG$5,\" \",AY8,\"\"))","v":false},{"$f":"IF(AZ8<>\"\",CONCATENATE(FH$5,\" \",AZ8,\"\"))","v":false},{"$f":"IF(BA8<>\"\",CONCATENATE(FI$5,\" \",BA8,\"\"))","v":false},{"$f":"IF(BB8<>\"\",CONCATENATE(FJ$5,\" \",BB8,\"\"))","v":false},{"$f":"IF(BC8<>\"\",CONCATENATE(FK$5,\" \",BC8,\"\"))","v":false},{"$f":"IF(BD8<>\"\",CONCATENATE(FL$5,\" \",BD8,\"\"))","v":false},{"$f":"SUM(BH8:CH8)","v":0}]
[null,{"$f":"IF(Plantilla!D5<>0,Plantilla!D5,\"\")","v":"Jean-Cr. Péraud"},null,null,null,null,null,null,null,null,null,null,null,null,null,null,null,null,null,null,null,null,null,null,null,null,null,null,null,null,null,null,null,null,null,null,null,null,null,null,null,null,null,null,null,null,null,null,null,null,null,null,null,null,null,null,null,0,{"$f":"IF(BF9=1,B9,\"\")","v":""},{"$f":"IFERROR(INDEX(general,MATCH(DK9,ranking_premios,0)),0)","v":0},{"$f":"IFERROR(INDEX(general,MATCH(DL9,ranking_premios,0)),0)","v":0},{"$f":"IFERROR(INDEX(general,MATCH(DM9,ranking_premios,0)),0)","v":0},{"$f":"IFERROR(INDEX(general,MATCH(DN9,ranking_premios,0)),0)","v":0},{"$f":"IFERROR(INDEX(general,MATCH(DO9,ranking_premios,0)),0)","v":0},{"$f":"IFERROR(INDEX(general,MATCH(DP9,ranking_premios,0)),0)","v":0},{"$f":"IFERROR(INDEX(general,MATCH(DQ9,ranking_premios,0)),0)","v":0},{"$f":"IFERROR(INDEX(general,MATCH(DR9,ranking_premios,0)),0)","v":0},{"$f":"IFERROR(INDEX(general,MATCH(DS9,ranking_premios,0)),0)","v":0},{"$f":"IFERROR(INDEX(general,MATCH(DT9,ranking_premios,0)),0)","v":0},{"$f":"IFERROR(INDEX(general,MATCH(DU9,ranking_premios,0)),0)","v":0},{"$f":"IFERROR(INDEX(general,MATCH(DV9,ranking_premios,0)),0)","v":0},{"$f":"IFERROR(INDEX(general,MATCH(DW9,ranking_premios,0)),0)","v":0},{"$f":"IFERROR(INDEX(general,MATCH(DX9,ranking_premios,0)),0)","v":0},{"$f":"IFERROR(INDEX(general,MATCH(DY9,ranking_premios,0)),0)","v":0},{"$f":"IFERROR(INDEX(general,MATCH(DZ9,ranking_premios,0)),0)","v":0},{"$f":"IFERROR(INDEX(general,MATCH(EA9,ranking_premios,0)),0)","v":0},{"$f":"IFERROR(INDEX(general,MATCH(EB9,ranking_premios,0)),0)","v":0},{"$f":"IFERROR(INDEX(general,MATCH(EC9,ranking_premios,0)),0)","v":0},{"$f":"IFERROR(INDEX(general,MATCH(ED9,ranking_premios,0)),0)","v":0},{"$f":"IFERROR(INDEX(general,MATCH(EE9,ranking_premios,0)),0)","v":0},{"$f":"IFERROR(INDEX(general,MATCH(EF9,ranking_premios,0)),0)","v":0},{"$f":"IFERROR(INDEX(general,MATCH(EG9,ranking_premios,0)),0)","v":0},{"$f":"IFERROR(INDEX(general,MATCH(EH9,ranking_premios,0)),0)","v":0},{"$f":"IFERROR(INDEX(general,MATCH(EI9,ranking_premios,0)),0)","v":0},{"$f":"IFERROR(INDEX(general,MATCH(EJ9,ranking_premios,0)),0)","v":0},{"$f":"IFERROR(INDEX(general,MATCH(EK9,ranking_premios,0)),0)","v":0},{"$f":"IFERROR(INDEX(general,MATCH(EL9,ranking_premios,0)),0)","v":0},{"$f":"IFERROR(INDEX(general,MATCH(EM9,ranking_premios,0)),0)","v":0},{"$f":"IFERROR(INDEX(general,MATCH(EN9,ranking_premios,0)),0)","v":0},{"$f":"IFERROR(INDEX(general,MATCH(EO9,ranking_premios,0)),0)","v":0},{"$f":"IFERROR(INDEX(general,MATCH(EP9,ranking_premios,0)),0)","v":0},{"$f":"IFERROR(INDEX(general,MATCH(EQ9,ranking_premios,0)),0)","v":0},{"$f":"IFERROR(INDEX(general,MATCH(ER9,ranking_premios,0)),0)","v":0},{"$f":"IFERROR(INDEX(general,MATCH(ES9,ranking_premios,0)),0)","v":0},{"$f":"IFERROR(INDEX(general,MATCH(ET9,ranking_premios,0)),0)","v":0},{"$f":"IFERROR(INDEX(general,MATCH(EU9,ranking_premios,0)),0)","v":0},{"$f":"IFERROR(INDEX(general,MATCH(EV9,ranking_premios,0)),0)","v":0},{"$f":"IFERROR(INDEX(general,MATCH(EW9,ranking_premios,0)),0)","v":0},{"$f":"IFERROR(INDEX(general,MATCH(EX9,ranking_premios,0)),0)","v":0},{"$f":"IFERROR(INDEX(general,MATCH(EY9,ranking_premios,0)),0)","v":0},{"$f":"IFERROR(INDEX(general,MATCH(EZ9,ranking_premios,0)),0)","v":0},{"$f":"IFERROR(INDEX(general,MATCH(FA9,ranking_premios,0)),0)","v":0},{"$f":"IFERROR(INDEX(general,MATCH(FB9,ranking_premios,0)),0)","v":0},{"$f":"IFERROR(INDEX(general,MATCH(FC9,ranking_premios,0)),0)","v":0},{"$f":"IFERROR(INDEX(general,MATCH(FD9,ranking_premios,0)),0)","v":0},{"$f":"IFERROR(INDEX(general,MATCH(FE9,ranking_premios,0)),0)","v":0},{"$f":"IFERROR(INDEX(general,MATCH(FF9,ranking_premios,0)),0)","v":0},{"$f":"IFERROR(INDEX(general,MATCH(FG9,ranking_premios,0)),0)","v":0},{"$f":"IFERROR(INDEX(general,MATCH(FH9,ranking_premios,0)),0)","v":0},{"$f":"IFERROR(INDEX(general,MATCH(FI9,ranking_premios,0)),0)","v":0},{"$f":"IFERROR(INDEX(general,MATCH(FJ9,ranking_premios,0)),0)","v":0},{"$f":"IFERROR(INDEX(general,MATCH(FK9,ranking_premios,0)),0)","v":0},{"$f":"IFERROR(INDEX(general,MATCH(FL9,ranking_premios,0)),0)","v":0},null,false,false,false,false,false,false,false,false,false,false,false,false,false,false,false,false,false,false,false,false,false,false,false,false,false,false,false,false,false,false,false,false,false,false,false,false,false,false,false,false,false,false,false,false,false,false,false,false,false,false,false,false,false,false,0]
[null,{"$f":"IF(Plantilla!D6<>0,Plantilla!D6,\"\")","v":"Daniel Martin"},null,null,null,null,null,null,null,null,null,null,null,null,null,null,null,null,null,null,null,null,null,null,null,null,null,null,null,null,null,null,null,null,null,null,null,null,null,null,null,null,null,null,null,null,null,null,null,null,null,null,null,null,null,null,null,0,"",0,0,0,0,0,0,0,0,0,0,0,0,0,0,0,0,0,0,0,0,0,0,0,0,0,0,0,0,0,0,0,0,0,0,0,0,0,0,0,0,0,0,0,0,0,0,0,0,0,0,0,0,0,0,null,false,false,false,false,false,false,false,false,false,false,false,false,false,false,false,false,false,false,false,false,false,false,false,false,false,false,false,false,false,false,false,false,false,false,false,false,false,false,false,false,false,false,false,false,false,false,false,false,false,false,false,false,false,false,0]
[null,{"$f":"IF(Plantilla!D7<>0,Plantilla!D7,\"\")","v":"José Joaquin Rojas"},null,null,null,null,null,null,null,null,null,null,null,null,null,null,null,null,null,null,null,null,null,null,null,null,null,null,null,null,null,null,null,null,null,null,null,null,null,null,null,null,null,null,null,null,null,null,null,null,null,null,null,null,null,null,null,0,"",0,0,0,0,0,0,0,0,0,0,0,0,0,0,0,0,0,0,0,0,0,0,0,0,0,0,0,0,0,0,0,0,0,0,0,0,0,0,0,0,0,0,0,0,0,0,0,0,0,0,0,0,0,0,null,false,false,false,false,false,false,false,false,false,false,false,false,false,false,false,false,false,false,false,false,false,false,false,false,false,false,false,false,false,false,false,false,false,false,false,false,false,false,false,false,false,false,false,false,false,false,false,false,false,false,false,false,false,false,0]
[null,{"$f":"IF(Plantilla!D8<>0,Plantilla!D8,\"\")","v":"Fran Ventoso"},null,null,null,null,null,null,null,null,null,null,null,null,null,null,null,null,null,null,null,null,null,null,null,null,null,null,null,null,null,null,null,null,null,null,null,null,null,null,null,null,null,null,null,null,null,null,null,null,null,null,null,null,null,null,null,0,"",0,0,0,0,0,0,0,0,0,0,0,0,0,0,0,0,0,0,0,0,0,0,0,0,0,0,0,0,0,0,0,0,0,0,0,0,0,0,0,0,0,0,0,0,0,0,0,0,0,0,0,0,0,0,null,false,false,false,false,false,false,false,false,false,false,false,false,false,false,false,false,false,false,false,false,false,false,false,false,false,false,false,false,false,false,false,false,false,false,false,false,false,false,false,false,false,false,false,false,false,false,false,false,false,false,false,false,false,false,0]
[null,{"$f":"IF(Plantilla!D9<>0,Plantilla!D9,\"\")","v":"Rui Costa"},null,null,null,null,null,null,null,null,null,null,null,null,null,null,null,null,null,null,null,null,null,null,null,null,null,null,null,null,null,null,null,null,null,null,null,null,null,null,null,null,null,null,null,null,null,null,null,null,null,null,null,null,null,null,null,0,"",0,0,0,0,0,0,0,0,0,0,0,0,0,0,0,0,0,0,0,0,0,0,0,0,0,0,0,0,0,0,0,0,0,0,0,0,0,0,0,0,0,0,0,0,0,0,0,0,0,0,0,0,0,0,null,false,false,false,false,false,false,false,false,false,false,false,false,false,false,false,false,false,false,false,false,false,false,false,false,false,false,false,false,false,false,false,false,false,false,false,false,false,false,false,false,false,false,false,false,false,false,false,false,false,false,false,false,false,false,0]
[null,{"$f":"IF(Plantilla!D10<>0,Plantilla!D10,\"\")","v":"Christopher Sutton"},null,null,null,null,null,null,null,null,null,null,null,null,null,null,null,null,null,null,null,null,null,null,null,null,null,null,null,null,null,null,null,null,null,null,null,null,null,null,null,null,null,null,null,null,null,null,null,null,null,null,null,null,null,null,null,0,"",0,0,0,0,0,0,0,0,0,0,0,0,0,0,0,0,0,0,0,0,0,0,0,0,0,0,0,0,0,0,0,0,0,0,0,0,0,0,0,0,0,0,0,0,0,0,0,0,0,0,0,0,0,0,null,false,false,false,false,false,false,false,false,false,false,false,false,false,false,false,false,false,false,false,false,false,false,false,false,false,false,false,false,false,false,false,false,false,false,false,false,false,false,false,false,false,false,false,false,false,false,false,false,false,false,false,false,false,false,0]
[null,{"$f":"IF(Plantilla!D11<>0,Plantilla!D11,\"\")","v":"Vladimir Karpets"},null,null,null,null,null,null,null,null,null,null,null,null,null,null,null,null,null,null,null,null,null,null,null,null,null,null,null,null,null,null,null,null,null,null,null,null,null,null,null,null,null,null,null,null,null,null,null,null,null,null,null,null,null,null,null,0,"",0,0,0,0,0,0,0,0,0,0,0,0,0,0,0,0,0,0,0,0,0,0,0,0,0,0,0,0,0,0,0,0,0,0,0,0,0,0,0,0,0,0,0,0,0,0,0,0,0,0,0,0,0,0,null,false,false,false,false,false,false,false,false,false,false,false,false,false,false,false,false,false,false,false,false,false,false,false,false,false,false,false,false,false,false,false,false,false,false,false,false,false,false,false,false,false,false,false,false,false,false,false,false,false,false,false,false,false,false,0]
[null,{"$f":"IF(Plantilla!D12<>0,Plantilla!D12,\"\")","v":"Julian Dean"},null,null,null,null,null,null,null,null,null,null,null,null,null,null,null,null,null,null,null,null,null,null,null,null,null,null,null,null,null,null,null,null,null,null,null,null,null,null,null,null,null,null,null,null,null,null,null,null,null,null,null,null,null,null,null,0,"",0,0,0,0,0,0,0,0,0,0,0,0,0,0,0,0,0,0,0,0,0,0,0,0,0,0,0,0,0,0,0,0,0,0,0,0,0,0,0,0,0,0,0,0,0,0,0,0,0,0,0,0,0,0,null,false,false,false,false,false,false,false,false,false,false,false,false,false,false,false,false,false,false,false,false,false,false,false,false,false,false,false,false,false,false,false,false,false,false,false,false,false,false,false,false,false,false,false,false,false,false,false,false,false,false,false,false,false,false,0]
[null,{"$f":"IF(Plantilla!D13<>0,Plantilla!D13,\"\")","v":"Andreas Klier"},null,null,null,null,null,null,null,null,null,null,null,null,null,null,null,null,null,null,null,null,null,null,null,null,null,null,null,null,null,null,null,null,null,null,null,null,null,null,null,null,null,null,null,null,null,null,null,null,null,null,null,null,null,null,null,0,"",0,0,0,0,0,0,0,0,0,0,0,0,0,0,0,0,0,0,0,0,0,0,0,0,0,0,0,0,0,0,0,0,0,0,0,0,0,0,0,0,0,0,0,0,0,0,0,0,0,0,0,0,0,0,null,false,false,false,false,false,false,false,false,false,false,false,false,false,false,false,false,false,false,false,false,false,false,false,false,false,false,false,false,false,false,false,false,false,false,false,false,false,false,false,false,false,false,false,false,false,false,false,false,false,false,false,false,false,false,0]
[null,{"$f":"IF(Plantilla!D14<>0,Plantilla!D14,\"\")","v":"Elia Viviani"},null,null,null,null,null,null,null,null,null,null,null,null,null,null,null,null,null,null,null,null,null,null,null,null,null,null,null,null,null,null,null,null,null,null,null,null,null,null,null,null,null,null,null,null,null,null,null,null,null,null,null,null,null,null,null,0,"",0,0,0,0,0,0,0,0,0,0,0,0,0,0,0,0,0,0,0,0,0,0,0,0,0,0,0,0,0,0,0,0,0,0,0,0,0,0,0,0,0,0,0,0,0,0,0,0,0,0,0,0,0,0,null,false,false,false,false,false,false,false,false,false,false,false,false,false,false,false,false,false,false,false,false,false,false,false,false,false,false,false,false,false,false,false,false,false,false,false,false,false,false,false,false,false,false,false,false,false,false,false,false,false,false,false,false,false,false,0]
[null,{"$f":"IF(Plantilla!D15<>0,Plantilla!D15,\"\")","v":"Daniel Navarro"},null,null,null,null,null,null,null,null,null,null,null,null,null,null,null,null,null,null,null,null,null,null,null,null,null,null,null,null,null,null,null,null,null,null,null,null,null,null,null,null,null,null,null,null,null,null,null,null,null,null,null,null,null,null,null,0,"",0,0,0,0,0,0,0,0,0,0,0,0,0,0,0,0,0,0,0,0,0,0,0,0,0,0,0,0,0,0,0,0,0,0,0,0,0,0,0,0,0,0,0,0,0,0,0,0,0,0,0,0,0,0,null,false,false,false,false,false,false,false,false,false,false,false,false,false,false,false,false,false,false,false,false,false,false,false,false,false,false,false,false,false,false,false,false,false,false,false,false,false,false,false,false,false,false,false,false,false,false,false,false,false,false,false,false,false,false,0]
[null,{"$f":"IF(Plantilla!D20<>0,Plantilla!D20,\"\")","v":"Jure Kocjan"},null,null,null,null,null,null,null,null,null,null,null,null,null,null,null,null,null,null,null,null,null,null,null,null,null,null,null,null,null,null,null,null,null,null,null,null,null,null,null,null,null,null,null,null,null,null,null,null,null,null,null,null,null,null,null,0,"",0,0,0,0,0,0,0,0,0,0,0,0,0,0,0,0,0,0,0,0,0,0,0,0,0,0,0,0,0,0,0,0,0,0,0,0,0,0,0,0,0,0,0,0,0,0,0,0,0,0,0,0,0,0,null,false,false,false,false,false,false,false,false,false,false,false,false,false,false,false,false,false,false,false,false,false,false,false,false,false,false,false,false,false,false,false,false,false,false,false,false,false,false,false,false,false,false,false,false,false,false,false,false,false,false,false,false,false,false,0]
[null,{"$f":"IF(Plantilla!D21<>0,Plantilla!D21,\"\")","v":"Przemyslaw Niemiec"},null,null,null,null,null,null,null,null,null,null,null,null,null,null,null,null,null,null,null,null,null,null,null,null,null,null,null,null,null,null,null,null,null,null,null,null,null,null,null,null,null,null,null,null,null,null,null,null,null,null,null,null,null,null,null,0,"",0,0,0,0,0,0,0,0,0,0,0,0,0,0,0,0,0,0,0,0,0,0,0,0,0,0,0,0,0,0,0,0,0,0,0,0,0,0,0,0,0,0,0,0,0,0,0,0,0,0,0,0,0,0,null,false,false,false,false,false,false,false,false,false,false,false,false,false,false,false,false,false,false,false,false,false,false,false,false,false,false,false,false,false,false,false,false,false,false,false,false,false,false,false,false,false,false,false,false,false,false,false,false,false,false,false,false,false,false,0]
[null,{"$f":"IF(Plantilla!D22<>0,Plantilla!D22,\"\")","v":"Sergio Paulinho"},null,null,null,null,null,null,null,null,null,null,null,null,null,null,null,null,null,null,null,null,null,null,null,null,null,null,null,null,null,null,null,null,null,null,null,null,null,null,null,null,null,null,null,null,null,null,null,null,null,null,null,null,null,null,null,0,"",0,0,0,0,0,0,0,0,0,0,0,0,0,0,0,0,0,0,0,0,0,0,0,0,0,0,0,0,0,0,0,0,0,0,0,0,0,0,0,0,0,0,0,0,0,0,0,0,0,0,0,0,0,0,null,false,false,false,false,false,false,false,false,false,false,false,false,false,false,false,false,false,false,false,false,false,false,false,false,false,false,false,false,false,false,false,false,false,false,false,false,false,false,false,false,false,false,false,false,false,false,false,false,false,false,false,false,false,false,0]
[null,{"$f":"IF(Plantilla!D19<>0,Plantilla!D19,\"\")","v":"Fabio Sabatini"},null,null,null,null,null,null,null,null,null,null,null,null,null,null,null,null,null,null,null,null,null,null,null,null,null,null,null,null,null,null,null,null,null,null,null,null,null,null,null,null,null,null,null,null,null,null,null,null,null,null,null,null,null,null,null,0,"",0,0,0,0,0,0,0,0,0,0,0,0,0,0,0,0,0,0,0,0,0,0,0,0,0,0,0,0,0,0,0,0,0,0,0,0,0,0,0,0,0,0,0,0,0,0,0,0,0,0,0,0,0,0,null,false,false,false,false,false,false,false,false,false,false,false,false,false,false,false,false,false,false,false,false,false,false,false,false,false,false,false,false,false,false,false,false,false,false,false,false,false,false,false,false,false,false,false,false,false,false,false,false,false,false,false,false,false,false,0]
[null,{"$f":"IF(Plantilla!D16<>0,Plantilla!D16,\"\")","v":"Johann Tschopp"},null,null,null,null,null,null,null,null,null,null,null,null,null,null,null,null,null,null,null,null,null,null,null,null,null,null,null,null,null,null,null,null,null,null,null,null,null,null,null,null,null,null,null,null,null,null,null,null,null,null,null,null,null,null,null,0,"",0,0,0,0,0,0,0,0,0,0,0,0,0,0,0,0,0,0,0,0,0,0,0,0,0,0,0,0,0,0,0,0,0,0,0,0,0,0,0,0,0,0,0,0,0,0,0,0,0,0,0,0,0,0,null,false,false,false,false,false,false,false,false,false,false,false,false,false,false,false,false,false,false,false,false,false,false,false,false,false,false,false,false,false,false,false,false,false,false,false,false,false,false,false,false,false,false,false,false,false,false,false,false,false,false,false,false,false,false,0]
[null,{"$f":"IF(Plantilla!D17<>0,Plantilla!D17,\"\")","v":"Miguel A. Ubeto"},null,null,null,null,null,null,null,null,null,null,null,null,null,null,null,null,null,null,null,null,null,null,null,null,null,null,null,null,null,null,null,null,null,null,null,null,null,null,null,null,null,null,null,null,null,null,null,null,null,null,null,null,null,null,null,0,"",0,0,0,0,0,0,0,0,0,0,0,0,0,0,0,0,0,0,0,0,0,0,0,0,0,0,0,0,0,0,0,0,0,0,0,0,0,0,0,0,0,0,0,0,0,0,0,0,0,0,0,0,0,0,null,false,false,false,false,false,false,false,false,false,false,false,false,false,false,false,false,false,false,false,false,false,false,false,false,false,false,false,false,false,false,false,false,false,false,false,false,false,false,false,false,false,false,false,false,false,false,false,false,false,false,false,false,false,false,0]
[null,{"$f":"IF(Plantilla!D18<>0,Plantilla!D18,\"\")","v":"Tom-Jelte Slagter"},null,null,null,null,null,null,null,null,null,null,null,null,null,null,null,null,null,null,null,null,null,null,null,null,null,null,null,null,null,null,null,null,null,null,null,null,null,null,null,null,null,null,null,null,null,null,null,null,null,null,null,null,null,null,null,0,"",0,0,0,0,0,0,0,0,0,0,0,0,0,0,0,0,0,0,0,0,0,0,0,0,0,0,0,0,0,0,0,0,0,0,0,0,0,0,0,0,0,0,0,0,0,0,0,0,0,0,0,0,0,0,null,false,false,false,false,false,false,false,false,false,false,false,false,false,false,false,false,false,false,false,false,false,false,false,false,false,false,false,false,false,false,false,false,false,false,false,false,false,false,false,false,false,false,false,false,false,false,false,false,false,false,false,false,false,false,0]
[null,{"$f":"IF(Plantilla!D23<>0,Plantilla!D23,\"\")","v":""},null,null,null,null,null,null,null,null,null,null,null,null,null,null,null,null,null,null,null,null,null,null,null,null,null,null,null,null,null,null,null,null,null,null,null,null,null,null,null,null,null,null,null,null,null,null,null,null,null,null,null,null,null,null,null,0,"",0,0,0,0,0,0,0,0,0,0,0,0,0,0,0,0,0,0,0,0,0,0,0,0,0,0,0,0,0,0,0,0,0,0,0,0,0,0,0,0,0,0,0,0,0,0,0,0,0,0,0,0,0,0,null,false,false,false,false,false,false,false,false,false,false,false,false,false,false,false,false,false,false,false,false,false,false,false,false,false,false,false,false,false,false,false,false,false,false,false,false,false,false,false,false,false,false,false,false,false,false,false,false,false,false,false,false,false,false,0]
[null,{"$f":"IF(Plantilla!D24<>0,Plantilla!D24,\"\")","v":""},null,null,null,null,null,null,null,null,null,null,null,null,null,null,null,null,null,null,null,null,null,null,null,null,null,null,null,null,null,null,null,null,null,null,null,null,null,null,null,null,null,null,null,null,null,null,null,null,null,null,null,null,null,null,null,0,"",0,0,0,0,0,0,0,0,0,0,0,0,0,0,0,0,0,0,0,0,0,0,0,0,0,0,0,0,0,0,0,0,0,0,0,0,0,0,0,0,0,0,0,0,0,0,0,0,0,0,0,0,0,0,null,false,false,false,false,false,false,false,false,false,false,false,false,false,false,false,false,false,false,false,false,false,false,false,false,false,false,false,false,false,false,false,false,false,false,false,false,false,false,false,false,false,false,false,false,false,false,false,false,false,false,false,false,false,false,0]
[null,{"$f":"IF(Plantilla!D25<>0,Plantilla!D25,\"\")","v":""},null,null,null,null,null,null,null,null,null,null,null,null,null,null,null,null,null,null,null,null,null,null,null,null,null,null,null,null,null,null,null,null,null,null,null,null,null,null,null,null,null,null,null,null,null,null,null,null,null,null,null,null,null,null,null,0,"",0,0,0,0,0,0,0,0,0,0,0,0,0,0,0,0,0,0,0,0,0,0,0,0,0,0,0,0,0,0,0,0,0,0,0,0,0,0,0,0,0,0,0,0,0,0,0,0,0,0,0,0,0,0,null,false,false,false,false,false,false,false,false,false,false,false,false,false,false,false,false,false,false,false,false,false,false,false,false,false,false,false,false,false,false,false,false,false,false,false,false,false,false,false,false,false,false,false,false,false,false,false,false,false,false,false,false,false,false,0]
[null,{"$f":"IF(Plantilla!D26<>0,Plantilla!D26,\"\")","v":""},null,null,null,null,null,null,null,null,null,null,null,null,null,null,null,null,null,null,null,null,null,null,null,null,null,null,null,null,null,null,null,null,null,null,null,null,null,null,null,null,null,null,null,null,null,null,null,null,null,null,null,null,null,null,null,0,"",0,0,0,0,0,0,0,0,0,0,0,0,0,0,0,0,0,0,0,0,0,0,0,0,0,0,0,0,0,0,0,0,0,0,0,0,0,0,0,0,0,0,0,0,0,0,0,0,0,0,0,0,0,0,null,false,false,false,false,false,false,false,false,false,false,false,false,false,false,false,false,false,false,false,false,false,false,false,false,false,false,false,false,false,false,false,false,false,false,false,false,false,false,false,false,false,false,false,false,false,false,false,false,false,false,false,false,false,false,0]
[null,{"$f":"IF(Plantilla!D27<>0,Plantilla!D27,\"\")","v":""},null,null,null,null,null,null,null,null,null,null,null,null,null,null,null,null,null,null,null,null,null,null,null,null,null,null,null,null,null,null,null,null,null,null,null,null,null,null,null,null,null,null,null,null,null,null,null,null,null,null,null,null,null,null,null,0,"",0,0,0,0,0,0,0,0,0,0,0,0,0,0,0,0,0,0,0,0,0,0,0,0,0,0,0,0,0,0,0,0,0,0,0,0,0,0,0,0,0,0,0,0,0,0,0,0,0,0,0,0,0,0,null,false,false,false,false,false,false,false,false,false,false,false,false,false,false,false,false,false,false,false,false,false,false,false,false,false,false,false,false,false,false,false,false,false,false,false,false,false,false,false,false,false,false,false,false,false,false,false,false,false,false,false,false,false,false,0]
[null,{"$f":"IF(Plantilla!D28<>0,Plantilla!D28,\"\")","v":""},null,null,null,null,null,null,null,null,null,null,null,null,null,null,null,null,null,null,null,null,null,null,null,null,null,null,null,null,null,null,null,null,null,null,null,null,null,null,null,null,null,null,null,null,null,null,null,null,null,null,null,null,null,null,null,0,"",0,0,0,0,0,0,0,0,0,0,0,0,0,0,0,0,0,0,0,0,0,0,0,0,0,0,0,0,0,0,0,0,0,0,0,0,0,0,0,0,0,0,0,0,0,0,0,0,0,0,0,0,0,0,null,false,false,false,false,false,false,false,false,false,false,false,false,false,false,false,false,false,false,false,false,false,false,false,false,false,false,false,false,false,false,false,false,false,false,false,false,false,false,false,false,false,false,false,false,false,false,false,false,false,false,false,false,false,false,0]
[null,{"$f":"IF(Plantilla!D29<>0,Plantilla!D29,\"\")","v":""},null,null,null,null,null,null,null,null,null,null,null,null,null,null,null,null,null,null,null,null,null,null,null,null,null,null,null,null,null,null,null,null,null,null,null,null,null,null,null,null,null,null,null,null,null,null,null,null,null,null,null,null,null,null,null,0,"",0,0,0,0,0,0,0,0,0,0,0,0,0,0,0,0,0,0,0,0,0,0,0,0,0,0,0,0,0,0,0,0,0,0,0,0,0,0,0,0,0,0,0,0,0,0,0,0,0,0,0,0,0,0,null,false,false,false,false,false,false,false,false,false,false,false,false,false,false,false,false,false,false,false,false,false,false,false,false,false,false,false,false,false,false,false,false,false,false,false,false,false,false,false,false,false,false,false,false,false,false,false,false,false,false,false,false,false,false,0]
[null,{"$f":"IF(Plantilla!D30<>0,Plantilla!D30,\"\")","v":""},null,null,null,null,null,null,null,null,null,null,null,null,null,null,null,null,null,null,null,null,null,null,null,null,null,null,null,null,null,null,null,null,null,null,null,null,null,null,null,null,null,null,null,null,null,null,null,null,null,null,null,null,null,null,null,0,"",0,0,0,0,0,0,0,0,0,0,0,0,0,0,0,0,0,0,0,0,0,0,0,0,0,0,0,0,0,0,0,0,0,0,0,0,0,0,0,0,0,0,0,0,0,0,0,0,0,0,0,0,0,0,null,false,false,false,false,false,false,false,false,false,false,false,false,false,false,false,false,false,false,false,false,false,false,false,false,false,false,false,false,false,false,false,false,false,false,false,false,false,false,false,false,false,false,false,false,false,false,false,false,false,false,false,false,false,false,0]
[null,{"$f":"IF(Plantilla!D31<>0,Plantilla!D31,\"\")","v":""},null,null,null,null,null,null,null,null,null,null,null,null,null,null,null,null,null,null,null,null,null,null,null,null,null,null,null,null,null,null,null,null,null,null,null,null,null,null,null,null,null,null,null,null,null,null,null,null,null,null,null,null,null,null,null,0,"",0,0,0,0,0,0,0,0,0,0,0,0,0,0,0,0,0,0,0,0,0,0,0,0,0,0,0,0,0,0,0,0,0,0,0,0,0,0,0,0,0,0,0,0,0,0,0,0,0,0,0,0,0,0,null,false,false,false,false,false,false,false,false,false,false,false,false,false,false,false,false,false,false,false,false,false,false,false,false,false,false,false,false,false,false,false,false,false,false,false,false,false,false,false,false,false,false,false,false,false,false,false,false,false,false,false,false,false,false,0]
[null,{"$f":"IF(Plantilla!D32<>0,Plantilla!D32,\"\")","v":""},null,null,null,null,null,null,null,null,null,null,null,null,null,null,null,null,null,null,null,null,null,null,null,null,null,null,null,null,null,null,null,null,null,null,null,null,null,null,null,null,null,null,null,null,null,null,null,null,null,null,null,null,null,null,null,0,"",0,0,0,0,0,0,0,0,0,0,0,0,0,0,0,0,0,0,0,0,0,0,0,0,0,0,0,0,0,0,0,0,0,0,0,0,0,0,0,0,0,0,0,0,0,0,0,0,0,0,0,0,0,0,null,false,false,false,false,false,false,false,false,false,false,false,false,false,false,false,false,false,false,false,false,false,false,false,false,false,false,false,false,false,false,false,false,false,false,false,false,false,false,false,false,false,false,false,false,false,false,false,false,false,false,false,false,false,false,0]
[null,{"$f":"IF(Plantilla!D33<>0,Plantilla!D33,\"\")","v":""},null,null,null,null,null,null,null,null,null,null,null,null,null,null,null,null,null,null,null,null,null,null,null,null,null,null,null,null,null,null,null,null,null,null,null,null,null,null,null,null,null,null,null,null,null,null,null,null,null,null,null,null,null,null,null,0,"",0,0,0,0,0,0,0,0,0,0,0,0,0,0,0,0,0,0,0,0,0,0,0,0,0,0,0,0,0,0,0,0,0,0,0,0,0,0,0,0,0,0,0,0,0,0,0,0,0,0,0,0,0,0,null,false,false,false,false,false,false,false,false,false,false,false,false,false,false,false,false,false,false,false,false,false,false,false,false,false,false,false,false,false,false,false,false,false,false,false,false,false,false,false,false,false,false,false,false,false,false,false,false,false,false,false,false,false,false,0]
[null,{"$f":"'Consulta General'!B2","v":"Vincenzo Nibali"},{"$f":"INDEX(C7:C37,MATCH($B$38,corredores,0))","v":0},0,0,0,0,0,0,0,0,0,0,0,0,0,0,0,0,0,0,0,0,0,0,0,0,0,0,0,0,0,0,0,{"$f":"INDEX(AI7:AI37,MATCH($B$38,corredores,0))","v":0},0,0,0,0,0,0,0,0,0,0,0,0,0,0,0,0,0,0,0,0,0]
[null,null,{"$f":"IF(C38<>0,C2,\"\")","v":""},{"$f":"IF(D38<>0,D2,\"\")","v":""},"","","","","","","","","","","","","","","","","","","","","","","","","","","","","","","","","","","","","","","","","","","","","","","","","","","",""]
[null,null,{"$f":"IF(C38=1,C3,\"\")","v":""},"","","","","","","","","","","","","","","","","","","","","","","","","","","","","","","","","","","","","","","","","","","","","","","","","","","","",""]
[null,{"$f":"IF(Plantilla!C36<>0,Plantilla!C36,\"\")","v":"Totales"},{"$f":"BH41","v":0},{"$f":"BI41","v":0},0,0,0,0,0,0,0,0,0,0,0,0,0,0,0,0,0,0,0,0,0,0,0,0,0,0,0,0,0,0,0,0,0,0,0,0,0,0,0,0,0,0,0,0,0,0,0,0,0,0,0,0,null,null,null,{"$f":"SUM(BH7:BH37)","v":0},{"$f":"SUM(BI7:BI37)","v":0},0,0,0,0,0,0,0,0,0,0,0,0,0,0,0,0,0,0,0,0,0,0,0,0,0,0,0,0,0,0,0,0,0,0,0,0,0,0,0,0,0,0,0,0,0,0,0,0,0,0,0,0,null,"Numero de carreras:",null,null,null,54,null,null,null,null,null,null,null,null,null,null,null,null,null,null,null,null,null,null,null,null,null,null,null,null,null,null,null,null,null,null,null,null,null,null,null,null,null,null,null,null,null,null,null,null,null,null,null,null,null,{"$f":"SUM(C41:BD41)","v":0}]
[null,{"$f":"IF(Plantilla!D38<>0,Plantilla!D38,\"\")","v":""}]

{"sheet":"Regularidad","index":8,"n_rows":42,"n_cols":169,"rows_kept":42,"cut":false,"hidden":false,"merged":[[4,168,5,168],[40,114,40,117]]}
[]
[null,null,{"$f":"Inscripciones!C1","v":"Campeonatos Nacionales ITT"},{"$f":"Inscripciones!D1","v":"Campeonatos Nacionales RR"},{"$f":"Inscripciones!E1","v":"Santos Tour Down Under"},{"$f":"Inscripciones!F1","v":"Milán-San Remo"},{"$f":"Inscripciones!G1","v":"Omloop"},{"$f":"Inscripciones!H1","v":"Tour de Flandres"},{"$f":"Inscripciones!I1","v":"E3 Prijs Vlaanderen-Harelbeke"},{"$f":"Inscripciones!J1","v":"Gent-Wevelgem"},{"$f":"Inscripciones!K1","v":"Paris-Roubaix"},{"$f":"Inscripciones!L1","v":"Strade Bianche"},{"$f":"Inscripciones!M1","v":"Paris-Niza"},{"$f":"Inscripciones!N1","v":"Amstel Gold Race"},{"$f":"Inscripciones!O1","v":"Flecha Valona"},{"$f":"Inscripciones!P1","v":"Lieja-Bastoña-Lieja"},{"$f":"Inscripciones!Q1","v":"Dauphiné Libéré"},{"$f":"Inscripciones!R1","v":"Tour de France"},{"$f":"Inscripciones!S1","v":"Chrono des Nations"},{"$f":"Inscripciones!T1","v":"GP du Québec"},{"$f":"Inscripciones!U1","v":"Vuelta al País Vasco"},{"$f":"Inscripciones!V1","v":"Critérium International"},{"$f":"Inscripciones!W1","v":"Hamburguer Turn"},{"$f":"Inscripciones!X1","v":"GP de Montréal"},{"$f":"Inscripciones!Y1","v":"GP de Lombardía"},{"$f":"Inscripciones!Z1","v":"Clásica San Sebastián"},{"$f":"Inscripciones!AA1","v":"Campeonatos del Mundo: Contrarreloj por Equipos"},{"$f":"Inscripciones!AB1","v":"Campeonatos del Mundo: Contrarreloj Individual "},{"$f":"Inscripciones!AC1","v":"Campeonatos del Mundo en Ruta"},{"$f":"Inscripciones!AD1","v":"Paris-Roubaix (1 Día) -- GC"},{"$f":"Inscripciones!AE1","v":"Grand Prix Cycliste de Montreal (1 Dia) -- TC"},{"$f":"Inscripciones!AF1","v":"Ronde van Drenthe (1 Dia) -- PC"},{"$f":"Inscripciones!AG1","v":"Vuelta a Burgos (5 Dias) -- PV"},{"$f":"Inscripciones!AH1","v":"Paris - Bruxelles (1 Dia) -- TC"},{"$f":"Inscripciones!AI1","v":"CN Sur de Europa: Contrarreloj Individual (1 Dia) CN"},{"$f":"Inscripciones!AJ1","v":"CN Este de Europa: Contrarreloj Individual (1 Dia) CN"},{"$f":"Inscripciones!AK1","v":"CN Norte de Europa: Contrarreloj Individual (1 Dia) CN"},{"$f":"Inscripciones!AL1","v":"CN America: Contrarreloj Individual (1 Dia) CN"},{"$f":"Inscripciones!AM1","v":"CN Resto del Mundo: Contrarreloj Individual (1 Dia) CN"},{"$f":"Inscripciones!AN1","v":"CN Sur de Europa: Ruta en Carretera (1 Dia) CN"},{"$f":"Inscripciones!AO1","v":"CN Este de Europa: Ruta en Carretera (1 Dia) CN"},{"$f":"Inscripciones!AP1","v":"CN Norte de Europa: Ruta en Carretera (1 Dia) CN"},{"$f":"Inscripciones!AQ1","v":"CN America: Ruta en Carretera (1 Dia) CN"},{"$f":"Inscripciones!AR1","v":"CN Resto del Mundo: Ruta en Carretera (1 Dia) CN"},{"$f":"Inscripciones!AS1","v":"Milano - Torino (1 Dia) -- TC"},{"$f":"Inscripciones!AT1","v":"Il Lombardía - Clasica de Lombardia (1 Día) -- GC"},{"$f":"Inscripciones!AU1","v":"Vuelta españa (21 Dias) -- GV"},{"$f":"Inscripciones!AV1","v":"Flèche Brabançonne (1 Día) -- TC"},{"$f":"Inscripciones!AW1","v":"Giro del Trentino (4 Dias) -- PV"},{"$f":"Inscripciones!AX1","v":"Tour of Beijing (5 Dias) -- TV"},{"$f":"Inscripciones!AY1","v":"Chrono des Nations (1 Día) -- PC"},{"$f":"Inscripciones!AZ1","v":"Japan Cup (1 Dia) -- PC"},{"$f":"Inscripciones!BA1","v":"Gante-Wevelgen (1 Día) -- MC"},{"$f":"Inscripciones!BB1","v":"Campeonatos del Mundo: Contrarreloj por Equipos (1 Día) -- MCE"},{"$f":"Inscripciones!BC1","v":"Campeonatos del Mundo: Contrarreloj Individual (1 Día) -- MCI"},{"$f":"Inscripciones!BD1","v":"Total"},null,{"$f":"'Consulta de Inscripciones'!B2","v":"Santos Tour Down Under"},null,{"$f":"C2","v":"Campeonatos Nacionales ITT"},"Campeonatos Nacionales RR","Santos Tour Down Under","Milán-San Remo","Omloop","Tour de Flandres","E3 Prijs Vlaanderen-Harelbeke","Gent-Wevelgem","Paris-Roubaix","Strade Bianche","Paris-Niza","Amstel Gold Race","Flecha Valona","Lieja-Bastoña-Lieja","Dauphiné Libéré","Tour de France","Chrono des Nations","GP du Québec","Vuelta al País Vasco","Critérium International","Hamburguer Turn","GP de Montréal","GP de Lombardía","Clásica San Sebastián","Campeonatos del Mundo: Contrarreloj por Equipos","Campeonatos del Mundo: Contrarreloj Individual ","Campeonatos del Mundo en Ruta","Paris-Roubaix (1 Día) -- GC","Grand Prix Cycliste de Montreal (1 Dia) -- TC","Ronde van Drenthe (1 Dia) -- PC","Vuelta a Burgos (5 Dias) -- PV","Paris - Bruxelles (1 Dia) -- TC","CN Sur de Europa: Contrarreloj Individual (1 Dia) CN","CN Este de Europa: Contrarreloj Individual (1 Dia) CN","CN Norte de Europa: Contrarreloj Individual (1 Dia) CN","CN America: Contrarreloj Individual (1 Dia) CN","CN Resto del Mundo: Contrarreloj Individual (1 Dia) CN","CN Sur de Europa: Ruta en Carretera (1 Dia) CN","CN Este de Europa: Ruta en Carretera (1 Dia) CN","CN Norte de Europa: Ruta en Carretera (1 Dia) CN","CN America: Ruta en Carretera (1 Dia) CN","CN Resto del Mundo: Ruta en Carretera (1 Dia) CN","Milano - Torino (1 Dia) -- TC","Il Lombardía - Clasica de Lombardia (1 Día) -- GC","Vuelta españa (21 Dias) -- GV","Flèche Brabançonne (1 Día) -- TC","Giro del Trentino (4 Dias) -- PV","Tour of Beijing (5 Dias) -- TV","Chrono des Nations (1 Día) -- PC","Japan Cup (1 Dia) -- PC","Gante-Wevelgen (1 Día) -- MC","Campeonatos del Mundo: Contrarreloj por Equipos (1 Día) -- MCE","Campeonatos del Mundo: Contrarreloj Individual (1 Día) -- MCI","Total",null,{"$f":"C2","v":"Campeonatos Nacionales ITT"},"Campeonatos Nacionales RR","Santos Tour Down Under","Milán-San Remo","Omloop","Tour de Flandres","E3 Prijs Vlaanderen-Harelbeke","Gent-Wevelgem","Paris-Roubaix","Strade Bianche","Paris-Niza","Amstel Gold Race","Flecha Valona","Lieja-Bastoña-Lieja","Dauphiné Libéré","Tour de France","Chrono des Nations","GP du Québec","Vuelta al País Vasco","Critérium International","Hamburguer Turn","GP de Montréal","GP de Lombardía","Clásica San Sebastián","Campeonatos del Mundo: Contrarreloj por Equipos","Campeonatos del Mundo: Contrarreloj Individual ","Campeonatos del Mundo en Ruta","Paris-Roubaix (1 Día) -- GC","Grand Prix Cycliste de Montreal (1 Dia) -- TC","Ronde van Drenthe (1 Dia) -- PC","Vuelta a Burgos (5 Dias) -- PV","Paris - Bruxelles (1 Dia) -- TC","CN Sur de Europa: Contrarreloj Individual (1 Dia) CN","CN Este de Europa: Contrarreloj Individual (1 Dia) CN","CN Norte de Europa: Contrarreloj Individual (1 Dia) CN","CN America: Contrarreloj Individual (1 Dia) CN","CN Resto del Mundo: Contrarreloj Individual (1 Dia) CN","CN Sur de Europa: Ruta en Carretera (1 Dia) CN","CN Este de Europa: Ruta en Carretera (1 Dia) CN","CN Norte de Europa: Ruta en Carretera (1 Dia) CN","CN America: Ruta en Carretera (1 Dia) CN","CN Resto del Mundo: Ruta en Carretera (1 Dia) CN","Milano - Torino (1 Dia) -- TC","Il Lombardía - Clasica de Lombardia (1 Día) -- GC","Vuelta españa (21 Dias) -- GV","Flèche Brabançonne (1 Día) -- TC","Giro del Trentino (4 Dias) -- PV","Tour of Beijing (5 Dias) -- TV","Chrono des Nations (1 Día) -- PC","Japan Cup (1 Dia) -- PC","Gante-Wevelgen (1 Día) -- MC","Campeonatos del Mundo: Contrarreloj por Equipos (1 Día) -- MCE","Campeonatos del Mundo: Contrarreloj Individual (1 Día) -- MCI","Total"]
[null,"Días",{"$f":"Inscripciones!C2","v":1},{"$f":"Inscripciones!D2","v":1},{"$f":"Inscripciones!E2","v":6},{"$f":"Inscripciones!F2","v":1},{"$f":"Inscripciones!G2","v":1},{"$f":"Inscripciones!H2","v":1},{"$f":"Inscripciones!I2","v":1},{"$f":"Inscripciones!J2","v":1},{"$f":"Inscripciones!K2","v":1},{"$f":"Inscripciones!L2","v":1},{"$f":"Inscripciones!M2","v":8},{"$f":"Inscripciones!N2","v":1},{"$f":"Inscripciones!O2","v":1},{"$f":"Inscripciones!P2","v":1},{"$f":"Inscripciones!Q2","v":8},{"$f":"Inscripciones!R2","v":21},{"$f":"Inscripciones!S2","v":1},{"$f":"Inscripciones!T2","v":1},{"$f":"Inscripciones!U2","v":6},{"$f":"Inscripciones!V2","v":3},{"$f":"Inscripciones!W2","v":1},{"$f":"Inscripciones!X2","v":1},{"$f":"Inscripciones!Y2","v":1},{"$f":"Inscripciones!Z2","v":1},{"$f":"Inscripciones!AA2","v":1},{"$f":"Inscripciones!AB2","v":1},{"$f":"Inscripciones!AC2","v":1},{"$f":"Inscripciones!AD2","v":1},{"$f":"Inscripciones!AE2","v":1},{"$f":"Inscripciones!AF2","v":1},{"$f":"Inscripciones!AG2","v":5},{"$f":"Inscripciones!AH2","v":1},{"$f":"Inscripciones!AI2","v":1},{"$f":"Inscripciones!AJ2","v":1},{"$f":"Inscripciones!AK2","v":1},{"$f":"Inscripciones!AL2","v":1},{"$f":"Inscripciones!AM2","v":1},{"$f":"Inscripciones!AN2","v":1},{"$f":"Inscripciones!AO2","v":1},{"$f":"Inscripciones!AP2","v":1},{"$f":"Inscripciones!AQ2","v":1},{"$f":"Inscripciones!AR2","v":1},{"$f":"Inscripciones!AS2","v":1},{"$f":"Inscripciones!AT2","v":1},{"$f":"Inscripciones!AU2","v":21},{"$f":"Inscripciones!AV2","v":1},{"$f":"Inscripciones!AW2","v":4},{"$f":"Inscripciones!AX2","v":5},{"$f":"Inscripciones!AY2","v":1},{"$f":"Inscripciones!AZ2","v":1},{"$f":"Inscripciones!BA2","v":1},{"$f":"Inscripciones!BB2","v":1},{"$f":"Inscripciones!BC2","v":1},{"$f":"Inscripciones!BD2","v":0}]
[null,"Mes",{"$f":"Inscripciones!C3","v":"Ag"},{"$f":"Inscripciones!D3","v":"Ag"},{"$f":"Inscripciones!G3","v":"Ag"},{"$f":"Inscripciones!H3","v":"Ag"},{"$f":"Inscripciones!I3","v":"Ag"},{"$f":"Inscripciones!J3","v":"Ag"},{"$f":"Inscripciones!K3","v":"Ag"},{"$f":"Inscripciones!L3","v":"Ag"},{"$f":"Inscripciones!M3","v":"S"},{"$f":"Inscripciones!N3","v":"S"},{"$f":"Inscripciones!O3","v":"S"},{"$f":"Inscripciones!P3","v":"S"},{"$f":"Inscripciones!Q3","v":"S"},{"$f":"Inscripciones!R3","v":"O"},{"$f":"Inscripciones!S3","v":"O"},{"$f":"Inscripciones!T3","v":"O"},{"$f":"Inscripciones!U3","v":"O"},{"$f":"Inscripciones!V3","v":"O"},{"$f":"Inscripciones!W3","v":"O"},{"$f":"Inscripciones!X3","v":"O"},{"$f":"Inscripciones!Y3","v":"O"},{"$f":"Inscripciones!Z3","v":"N"},{"$f":"Inscripciones!AA3","v":"N"},{"$f":"Inscripciones!AC3","v":"N"},{"$f":"Inscripciones!AD3","v":0},{"$f":"Inscripciones!AE3","v":"My"},{"$f":"Inscripciones!AF3","v":"My"},{"$f":"Inscripciones!AD3","v":0},{"$f":"Inscripciones!AE3","v":"My"},{"$f":"Inscripciones!AF3","v":"My"},{"$f":"Inscripciones!AG3","v":"My"},{"$f":"Inscripciones!AH3","v":"My"},{"$f":"Inscripciones!AI3","v":"My"},{"$f":"Inscripciones!AJ3","v":"My"},{"$f":"Inscripciones!AK3","v":"My"},{"$f":"Inscripciones!AL3","v":"My"},{"$f":"Inscripciones!AM3","v":"My"},{"$f":"Inscripciones!AN3","v":"My"},{"$f":"Inscripciones!AO3","v":"My"},{"$f":"Inscripciones!AP3","v":"My"},{"$f":"Inscripciones!AQ3","v":"My"},{"$f":"Inscripciones!AR3","v":"My"},{"$f":"Inscripciones!AS3","v":"My"},{"$f":"Inscripciones!AT3","v":"My"},{"$f":"Inscripciones!AU3","v":"J"},{"$f":"Inscripciones!AV3","v":"J"},{"$f":"Inscripciones!AW3","v":"J"},{"$f":"Inscripciones!AX3","v":"J"},{"$f":"Inscripciones!AY3","v":"J"},{"$f":"Inscripciones!AZ3","v":"J"},{"$f":"Inscripciones!BA3","v":"J"},{"$f":"Inscripciones!BB3","v":"J"},{"$f":"Inscripciones!BC3","v":"J"},{"$f":"Inscripciones!BD3","v":0},null,"J","J",null,null,null,null,null,null,null,null,null,null,null,null,null,null,null,null,null,null,null,null,null,null,null,null,null,null,null,null,null,null,null,null,null,null,null,null,null,null,null,null,null,null,null,null,null,null,null,null,null,null,null,null,null,null,null,"J","J","J","J","J","J","J","J","J","J","J","J","J","J","J","J","J","J","J","J","J","J","J","J","J","J","J","J","J","J","J","J","J","J","J","J","J","J","J","J","J","J","J","J","J","J","J","J","J","J","J","J","J","J","Códigos"]
[null,"Tipo",{"$f":"Inscripciones!C4","v":0},{"$f":"Inscripciones!D4","v":0},{"$f":"Inscripciones!E4","v":"2.HC"},{"$f":"Inscripciones!F4","v":"1.UWT"},{"$f":"Inscripciones!G4","v":1.1000000000000001},{"$f":"Inscripciones!H4","v":"1.UWT"},{"$f":"Inscripciones!I4","v":"1.HC"},{"$f":"Inscripciones!J4","v":"1.HC"},{"$f":"Inscripciones!K4","v":"1.UWT"},{"$f":"Inscripciones!L4","v":1.1000000000000001},{"$f":"Inscripciones!M4","v":"2.UWT"},{"$f":"Inscripciones!N4","v":"1.HC"},{"$f":"Inscripciones!O4","v":"1.HC"},{"$f":"Inscripciones!P4","v":"1.UWT"},{"$f":"Inscripciones!Q4","v":"2.UWT"},{"$f":"Inscripciones!R4","v":"GV"},{"$f":"Inscripciones!S4","v":1.1000000000000001},{"$f":"Inscripciones!T4","v":1.1000000000000001},{"$f":"Inscripciones!U4","v":"2.HC"},{"$f":"Inscripciones!V4","v":2.1},{"$f":"Inscripciones!W4","v":1.1000000000000001},{"$f":"Inscripciones!X4","v":"1.HC"},{"$f":"Inscripciones!Y4","v":"1.UWT"},{"$f":"Inscripciones!Z4","v":"1.HC"},{"$f":"Inscripciones!AA4","v":"WC TTT"},{"$f":"Inscripciones!AB4","v":"WC ITT"},{"$f":"Inscripciones!AC4","v":"WC RR"},{"$f":"Inscripciones!AD4","v":"TC"},{"$f":"Inscripciones!AE4","v":"TC"},{"$f":"Inscripciones!AF4","v":"PC"},{"$f":"Inscripciones!AG4","v":"PV"},{"$f":"Inscripciones!AH4","v":"TC"},{"$f":"Inscripciones!AI4","v":"CN"},{"$f":"Inscripciones!AJ4","v":"CN"},{"$f":"Inscripciones!AK4","v":"CN"},{"$f":"Inscripciones!AL4","v":"CN"},{"$f":"Inscripciones!AM4","v":"CN"},{"$f":"Inscripciones!AN4","v":"CN"},{"$f":"Inscripciones!AO4","v":"CN"},{"$f":"Inscripciones!AP4","v":"CN"},{"$f":"Inscripciones!AQ4","v":"CN"},{"$f":"Inscripciones!AR4","v":"CN"},{"$f":"Inscripciones!AS4","v":"TC"},{"$f":"Inscripciones!AT4","v":"GC"},{"$f":"Inscripciones!AU4","v":"GV"},{"$f":"Inscripciones!AV4","v":"TC"},{"$f":"Inscripciones!AW4","v":"PV"},{"$f":"Inscripciones!AX4","v":"TV"},{"$f":"Inscripciones!AY4","v":"PC"},{"$f":"Inscripciones!AZ4","v":"PC"},{"$f":"Inscripciones!BA4","v":"MC"},{"$f":"Inscripciones!BB4","v":"MCE"},{"$f":"Inscripciones!BC4","v":"MCI"},{"$f":"Inscripciones!BD4","v":0},null,null,null,null,null,null,null,null,null,null,null,null,null,null,null,null,null,null,null,null,null,null,null,null,null,null,null,null,null,null,null,null,null,null,null,null,null,null,null,null,null,null,null,null,null,null,null,null,null,null,null,null,null,null,null,null,null,null,{"$f":"C5","v":0},0,"2.HC","1.UWT",1.1000000000000001,"1.UWT","1.HC","1.HC","1.UWT",1.1000000000000001,"2.UWT","1.HC","1.HC","1.UWT","2.UWT","GV",1.1000000000000001,1.1000000000000001,"2.HC",2.1,1.1000000000000001,"1.HC","1.UWT","1.HC","WC TTT","WC ITT","WC RR","TC","TC","PC","PV","TC","CN","CN","CN","CN","CN","CN","CN","CN","CN","CN","TC","GC","GV","TC","PV","TV","PC","PC","MC","MCE","MCI",0,"Cambiar los premios"]
[null,"Precio",{"$f":"Inscripciones!C5","v":0},{"$f":"Inscripciones!D5","v":0},{"$f":"Inscripciones!E5","v":8000},{"$f":"Inscripciones!F5","v":8000},{"$f":"Inscripciones!G5","v":1200},{"$f":"Inscripciones!H5","v":8000},{"$f":"Inscripciones!I5","v":4800},{"$f":"Inscripciones!J5","v":4800},{"$f":"Inscripciones!K5","v":8000},{"$f":"Inscripciones!L5","v":1200},{"$f":"Inscripciones!M5","v":8000},{"$f":"Inscripciones!N5","v":4800},{"$f":"Inscripciones!O5","v":4800},{"$f":"Inscripciones!P5","v":8000},{"$f":"Inscripciones!Q5","v":8000},{"$f":"Inscripciones!R5","v":100000},{"$f":"Inscripciones!S5","v":1200},{"$f":"Inscripciones!T5","v":1200},{"$f":"Inscripciones!U5","v":8000},{"$f":"Inscripciones!V5","v":1600},{"$f":"Inscripciones!W5","v":1200},{"$f":"Inscripciones!X5","v":4800},{"$f":"Inscripciones!Y5","v":8000},{"$f":"Inscripciones!Z5","v":4800},{"$f":"Inscripciones!AA5","v":2000},{"$f":"Inscripciones!AB5","v":2000},{"$f":"Inscripciones!AC5","v":6000},{"$f":"Inscripciones!AD5","v":6000},{"$f":"Inscripciones!AE5","v":6000},{"$f":"Inscripciones!AF5","v":6000},{"$f":"Inscripciones!AG5","v":6000},{"$f":"Inscripciones!AH5","v":6000},{"$f":"Inscripciones!AI5","v":8000},{"$f":"Inscripciones!AJ5","v":8000},{"$f":"Inscripciones!AK5","v":8000},{"$f":"Inscripciones!AL5","v":8000},{"$f":"Inscripciones!AM5","v":8000},{"$f":"Inscripciones!AN5","v":8000},{"$f":"Inscripciones!AO5","v":8000},{"$f":"Inscripciones!AP5","v":8000},{"$f":"Inscripciones!AQ5","v":8000},{"$f":"Inscripciones!AR5","v":8000},{"$f":"Inscripciones!AS5","v":6000},{"$f":"Inscripciones!AT5","v":8000},{"$f":"Inscripciones!AU5","v":100000},{"$f":"Inscripciones!AV5","v":6000},{"$f":"Inscripciones!AW5","v":6000},{"$f":"Inscripciones!AX5","v":6000},{"$f":"Inscripciones!AY5","v":6000},{"$f":"Inscripciones!AZ5","v":6000},{"$f":"Inscripciones!BA5","v":6000},{"$f":"Inscripciones!BB5","v":6000},{"$f":"Inscripciones!BC5","v":6000},{"$f":"Inscripciones!BD5","v":0}]
[null,{"$f":"IF(Plantilla!D3<>0,Plantilla!D3,\"\")","v":"Vincenzo Nibali"},null,null,null,null,null,null,null,null,null,null,null,null,null,null,null,null,null,null,null,null,null,null,null,null,null,null,null,null,null,null,null,null,null,null,null,null,null,null,null,null,null,null,null,null,null,null,null,null,null,null,null,null,null,null,null,{"$f":"INDIRECT(ADDRESS(ROW(),MATCH($BF$2,carreras,0)+1))","v":0},{"$f":"IF(BF7=1,B7,\"\")","v":""},{"$f":"IFERROR(INDEX(secundarias,MATCH(DK7,ranking_premios,0)),0)","v":0},{"$f":"IFERROR(INDEX(secundarias,MATCH(DL7,ranking_premios,0)),0)","v":0},{"$f":"IFERROR(INDEX(secundarias,MATCH(DM7,ranking_premios,0)),0)","v":0},{"$f":"IFERROR(INDEX(secundarias,MATCH(DN7,ranking_premios,0)),0)","v":0},{"$f":"IFERROR(INDEX(secundarias,MATCH(DO7,ranking_premios,0)),0)","v":0},{"$f":"IFERROR(INDEX(secundarias,MATCH(DP7,ranking_premios,0)),0)","v":0},{"$f":"IFERROR(INDEX(secundarias,MATCH(DQ7,ranking_premios,0)),0)","v":0},{"$f":"IFERROR(INDEX(secundarias,MATCH(DR7,ranking_premios,0)),0)","v":0},{"$f":"IFERROR(INDEX(secundarias,MATCH(DS7,ranking_premios,0)),0)","v":0},{"$f":"IFERROR(INDEX(secundarias,MATCH(DT7,ranking_premios,0)),0)","v":0},{"$f":"IFERROR(INDEX(secundarias,MATCH(DU7,ranking_premios,0)),0)","v":0},{"$f":"IFERROR(INDEX(secundarias,MATCH(DV7,ranking_premios,0)),0)","v":0},{"$f":"IFERROR(INDEX(secundarias,MATCH(DW7,ranking_premios,0)),0)","v":0},{"$f":"IFERROR(INDEX(secundarias,MATCH(DX7,ranking_premios,0)),0)","v":0},{"$f":"IFERROR(INDEX(secundarias,MATCH(DY7,ranking_premios,0)),0)","v":0},{"$f":"IFERROR(INDEX(secundarias,MATCH(DZ7,ranking_premios,0)),0)","v":0},{"$f":"IFERROR(INDEX(secundarias,MATCH(EA7,ranking_premios,0)),0)","v":0},{"$f":"IFERROR(INDEX(secundarias,MATCH(EB7,ranking_premios,0)),0)","v":0},{"$f":"IFERROR(INDEX(secundarias,MATCH(EC7,ranking_premios,0)),0)","v":0},{"$f":"IFERROR(INDEX(secundarias,MATCH(ED7,ranking_premios,0)),0)","v":0},{"$f":"IFERROR(INDEX(secundarias,MATCH(EE7,ranking_premios,0)),0)","v":0},{"$f":"IFERROR(INDEX(secundarias,MATCH(EF7,ranking_premios,0)),0)","v":0},{"$f":"IFERROR(INDEX(secundarias,MATCH(EG7,ranking_premios,0)),0)","v":0},{"$f":"IFERROR(INDEX(secundarias,MATCH(EH7,ranking_premios,0)),0)","v":0},{"$f":"IFERROR(INDEX(secundarias,MATCH(EI7,ranking_premios,0)),0)","v":0},{"$f":"IFERROR(INDEX(secundarias,MATCH(EJ7,ranking_premios,0)),0)","v":0},{"$f":"IFERROR(INDEX(secundarias,MATCH(EK7,ranking_premios,0)),0)","v":0},{"$f":"IFERROR(INDEX(secundarias,MATCH(EL7,ranking_premios,0)),0)","v":0},{"$f":"IFERROR(INDEX(secundarias,MATCH(EM7,ranking_premios,0)),0)","v":0},{"$f":"IFERROR(INDEX(secundarias,MATCH(EN7,ranking_premios,0)),0)","v":0},{"$f":"IFERROR(INDEX(secundarias,MATCH(EO7,ranking_premios,0)),0)","v":0},{"$f":"IFERROR(INDEX(secundarias,MATCH(EP7,ranking_premios,0)),0)","v":0},{"$f":"IFERROR(INDEX(secundarias,MATCH(EQ7,ranking_premios,0)),0)","v":0},{"$f":"IFERROR(INDEX(secundarias,MATCH(ER7,ranking_premios,0)),0)","v":0},{"$f":"IFERROR(INDEX(secundarias,MATCH(ES7,ranking_premios,0)),0)","v":0},{"$f":"IFERROR(INDEX(secundarias,MATCH(ET7,ranking_premios,0)),0)","v":0},{"$f":"IFERROR(INDEX(secundarias,MATCH(EU7,ranking_premios,0)),0)","v":0},{"$f":"IFERROR(INDEX(secundarias,MATCH(EV7,ranking_premios,0)),0)","v":0},{"$f":"IFERROR(INDEX(secundarias,MATCH(EW7,ranking_premios,0)),0)","v":0},{"$f":"IFERROR(INDEX(secundarias,MATCH(EX7,ranking_premios,0)),0)","v":0},{"$f":"IFERROR(INDEX(secundarias,MATCH(EY7,ranking_premios,0)),0)","v":0},{"$f":"IFERROR(INDEX(secundarias,MATCH(EZ7,ranking_premios,0)),0)","v":0},{"$f":"IFERROR(INDEX(secundarias,MATCH(FA7,ranking_premios,0)),0)","v":0},{"$f":"IFERROR(INDEX(secundarias,MATCH(FB7,ranking_premios,0)),0)","v":0},{"$f":"IFERROR(INDEX(secundarias,MATCH(FC7,ranking_premios,0)),0)","v":0},{"$f":"IFERROR(INDEX(secundarias,MATCH(FD7,ranking_premios,0)),0)","v":0},{"$f":"IFERROR(INDEX(secundarias,MATCH(FE7,ranking_premios,0)),0)","v":0},{"$f":"IFERROR(INDEX(secundarias,MATCH(FF7,ranking_premios,0)),0)","v":0},{"$f":"IFERROR(INDEX(secundarias,MATCH(FG7,ranking_premios,0)),0)","v":0},{"$f":"IFERROR(INDEX(secundarias,MATCH(FH7,ranking_premios,0)),0)","v":0},{"$f":"IFERROR(INDEX(secundarias,MATCH(FI7,ranking_premios,0)),0)","v":0},{"$f":"IFERROR(INDEX(secundarias,MATCH(FJ7,ranking_premios,0)),0)","v":0},{"$f":"IFERROR(INDEX(secundarias,MATCH(FK7,ranking_premios,0)),0)","v":0},{"$f":"IFERROR(INDEX(secundarias,MATCH(FL7,ranking_premios,0)),0)","v":0},null,{"$f":"IF(C7<>\"\",CONCATENATE(DK$5,\" \",C7,\"\"))","v":false},{"$f":"IF(D7<>\"\",CONCATENATE(DL$5,\" \",D7,\"\"))","v":false},false,false,false,false,false,false,false,false,false,false,false,false,false,false,false,false,false,false,false,false,false,false,false,false,false,false,false,false,false,false,false,false,false,false,false,false,false,false,false,false,false,false,false,false,false,false,false,false,false,false,false,false,{"$f":"SUM(BH7:CH7)","v":0}]
[null,{"$f":"IF(Plantilla!D4<>0,Plantilla!D4,\"\")","v":"Samuel Sánchez"},null,null,null,null,null,null,null,null,null,null,null,null,null,null,null,null,null,null,null,null,null,null,null,null,null,null,null,null,null,null,null,null,null,null,null,null,null,null,null,null,null,null,null,null,null,null,null,null,null,null,null,null,null,null,null,{"$f":"INDIRECT(ADDRESS(ROW(),MATCH($BF$2,carreras,0)+1))","v":0},"",0,0,0,0,0,{"$f":"IFERROR(INDEX(secundarias,MATCH(DP8,ranking_premios,0)),0)","v":0},0,0,0,0,0,0,0,0,0,0,0,0,0,0,0,0,0,0,0,0,0,0,0,0,0,0,0,0,0,0,0,0,0,0,0,0,0,0,0,0,0,0,0,0,0,0,0,0,null,{"$f":"IF(C8<>\"\",CONCATENATE(DK$5,\" \",C8,\"\"))","v":false},{"$f":"IF(D8<>\"\",CONCATENATE(DL$5,\" \",D8,\"\"))","v":false},{"$f":"IF(E8<>\"\",CONCATENATE(DM$5,\" \",E8,\"\"))","v":false},{"$f":"IF(F8<>\"\",CONCATENATE(DN$5,\" \",F8,\"\"))","v":false},{"$f":"IF(G8<>\"\",CONCATENATE(DO$5,\" \",G8,\"\"))","v":false},{"$f":"IF(H8<>\"\",CONCATENATE(DP$5,\" \",H8,\"\"))","v":false},{"$f":"IF(I8<>\"\",CONCATENATE(DQ$5,\" \",I8,\"\"))","v":false},{"$f":"IF(J8<>\"\",CONCATENATE(DR$5,\" \",J8,\"\"))","v":false},{"$f":"IF(K8<>\"\",CONCATENATE(DS$5,\" \",K8,\"\"))","v":false},{"$f":"IF(L8<>\"\",CONCATENATE(DT$5,\" \",L8,\"\"))","v":false},{"$f":"IF(M8<>\"\",CONCATENATE(DU$5,\" \",M8,\"\"))","v":false},{"$f":"IF(N8<>\"\",CONCATENATE(DV$5,\" \",N8,\"\"))","v":false},{"$f":"IF(O8<>\"\",CONCATENATE(DW$5,\" \",O8,\"\"))","v":false},{"$f":"IF(P8<>\"\",CONCATENATE(DX$5,\" \",P8,\"\"))","v":false},{"$f":"IF(Q8<>\"\",CONCATENATE(DY$5,\" \",Q8,\"\"))","v":false},{"$f":"IF(R8<>\"\",CONCATENATE(DZ$5,\" \",R8,\"\"))","v":false},{"$f":"IF(S8<>\"\",CONCATENATE(EA$5,\" \",S8,\"\"))","v":false},{"$f":"IF(T8<>\"\",CONCATENATE(EB$5,\" \",T8,\"\"))","v":false},{"$f":"IF(U8<>\"\",CONCATENATE(EC$5,\" \",U8,\"\"))","v":false},{"$f":"IF(V8<>\"\",CONCATENATE(ED$5,\" \",V8,\"\"))","v":false},{"$f":"IF(W8<>\"\",CONCATENATE(EE$5,\" \",W8,\"\"))","v":false},{"$f":"IF(X8<>\"\",CONCATENATE(EF$5,\" \",X8,\"\"))","v":false},{"$f":"IF(Y8<>\"\",CONCATENATE(EG$5,\" \",Y8,\"\"))","v":false},{"$f":"IF(Z8<>\"\",CONCATENATE(EH$5,\" \",Z8,\"\"))","v":false},{"$f":"IF(AA8<>\"\",CONCATENATE(EI$5,\" \",AA8,\"\"))","v":false},{"$f":"IF(AB8<>\"\",CONCATENATE(EJ$5,\" \",AB8,\"\"))","v":false},{"$f":"IF(AC8<>\"\",CONCATENATE(EK$5,\" \",AC8,\"\"))","v":false},{"$f":"IF(AD8<>\"\",CONCATENATE(EL$5,\" \",AD8,\"\"))","v":false},{"$f":"IF(AE8<>\"\",CONCATENATE(EM$5,\" \",AE8,\"\"))","v":false},{"$f":"IF(AF8<>\"\",CONCATENATE(EN$5,\" \",AF8,\"\"))","v":false},{"$f":"IF(AG8<>\"\",CONCATENATE(EO$5,\" \",AG8,\"\"))","v":false},{"$f":"IF(AH8<>\"\",CONCATENATE(EP$5,\" \",AH8,\"\"))","v":false},{"$f":"IF(AI8<>\"\",CONCATENATE(EQ$5,\" \",AI8,\"\"))","v":false},{"$f":"IF(AJ8<>\"\",CONCATENATE(ER$5,\" \",AJ8,\"\"))","v":false},{"$f":"IF(AK8<>\"\",CONCATENATE(ES$5,\" \",AK8,\"\"))","v":false},{"$f":"IF(AL8<>\"\",CONCATENATE(ET$5,\" \",AL8,\"\"))","v":false},{"$f":"IF(AM8<>\"\",CONCATENATE(EU$5,\" \",AM8,\"\"))","v":false},{"$f":"IF(AN8<>\"\",CONCATENATE(EV$5,\" \",AN8,\"\"))","v":false},{"$f":"IF(AO8<>\"\",CONCATENATE(EW$5,\" \",AO8,\"\"))","v":false},{"$f":"IF(AP8<>\"\",CONCATENATE(EX$5,\" \",AP8,\"\"))","v":false},{"$f":"IF(AQ8<>\"\",CONCATENATE(EY$5,\" \",AQ8,\"\"))","v":false},{"$f":"IF(AR8<>\"\",CONCATENATE(EZ$5,\" \",AR8,\"\"))","v":false},{"$f":"IF(AS8<>\"\",CONCATENATE(FA$5,\" \",AS8,\"\"))","v":false},{"$f":"IF(AT8<>\"\",CONCATENATE(FB$5,\" \",AT8,\"\"))","v":false},{"$f":"IF(AU8<>\"\",CONCATENATE(FC$5,\" \",AU8,\"\"))","v":false},{"$f":"IF(AV8<>\"\",CONCATENATE(FD$5,\" \",AV8,\"\"))","v":false},{"$f":"IF(AW8<>\"\",CONCATENATE(FE$5,\" \",AW8,\"\"))","v":false},{"$f":"IF(AX8<>\"\",CONCATENATE(FF$5,\" \",AX8,\"\"))","v":false},{"$f":"IF(AY8<>\"\",CONCATENATE(FG$5,\" \",AY8,\"\"))","v":false},{"$f":"IF(AZ8<>\"\",CONCATENATE(FH$5,\" \",AZ8,\"\"))","v":false},{"$f":"IF(BA8<>\"\",CONCATENATE(FI$5,\" \",BA8,\"\"))","v":false},{"$f":"IF(BB8<>\"\",CONCATENATE(FJ$5,\" \",BB8,\"\"))","v":false},{"$f":"IF(BC8<>\"\",CONCATENATE(FK$5,\" \",BC8,\"\"))","v":false},{"$f":"IF(BD8<>\"\",CONCATENATE(FL$5,\" \",BD8,\"\"))","v":false},{"$f":"SUM(BH8:CH8)","v":0}]
[null,{"$f":"IF(Plantilla!D5<>0,Plantilla!D5,\"\")","v":"Jean-Cr. Péraud"},null,null,null,null,null,null,null,null,null,null,null,null,null,null,null,null,null,null,null,null,null,null,null,null,null,null,null,null,null,null,null,null,null,null,null,null,null,null,null,null,null,null,null,null,null,null,null,null,null,null,null,null,null,null,null,0,{"$f":"IF(BF9=1,B9,\"\")","v":""},{"$f":"IFERROR(INDEX(secundarias,MATCH(DK9,ranking_premios,0)),0)","v":0},{"$f":"IFERROR(INDEX(secundarias,MATCH(DL9,ranking_premios,0)),0)","v":0},{"$f":"IFERROR(INDEX(secundarias,MATCH(DM9,ranking_premios,0)),0)","v":0},{"$f":"IFERROR(INDEX(secundarias,MATCH(DN9,ranking_premios,0)),0)","v":0},{"$f":"IFERROR(INDEX(secundarias,MATCH(DO9,ranking_premios,0)),0)","v":0},{"$f":"IFERROR(INDEX(secundarias,MATCH(DP9,ranking_premios,0)),0)","v":0},{"$f":"IFERROR(INDEX(secundarias,MATCH(DQ9,ranking_premios,0)),0)","v":0},{"$f":"IFERROR(INDEX(secundarias,MATCH(DR9,ranking_premios,0)),0)","v":0},{"$f":"IFERROR(INDEX(secundarias,MATCH(DS9,ranking_premios,0)),0)","v":0},{"$f":"IFERROR(INDEX(secundarias,MATCH(DT9,ranking_premios,0)),0)","v":0},{"$f":"IFERROR(INDEX(secundarias,MATCH(DU9,ranking_premios,0)),0)","v":0},{"$f":"IFERROR(INDEX(secundarias,MATCH(DV9,ranking_premios,0)),0)","v":0},{"$f":"IFERROR(INDEX(secundarias,MATCH(DW9,ranking_premios,0)),0)","v":0},{"$f":"IFERROR(INDEX(secundarias,MATCH(DX9,ranking_premios,0)),0)","v":0},{"$f":"IFERROR(INDEX(secundarias,MATCH(DY9,ranking_premios,0)),0)","v":0},{"$f":"IFERROR(INDEX(secundarias,MATCH(DZ9,ranking_premios,0)),0)","v":0},{"$f":"IFERROR(INDEX(secundarias,MATCH(EA9,ranking_premios,0)),0)","v":0},{"$f":"IFERROR(INDEX(secundarias,MATCH(EB9,ranking_premios,0)),0)","v":0},{"$f":"IFERROR(INDEX(secundarias,MATCH(EC9,ranking_premios,0)),0)","v":0},{"$f":"IFERROR(INDEX(secundarias,MATCH(ED9,ranking_premios,0)),0)","v":0},{"$f":"IFERROR(INDEX(secundarias,MATCH(EE9,ranking_premios,0)),0)","v":0},{"$f":"IFERROR(INDEX(secundarias,MATCH(EF9,ranking_premios,0)),0)","v":0},{"$f":"IFERROR(INDEX(secundarias,MATCH(EG9,ranking_premios,0)),0)","v":0},{"$f":"IFERROR(INDEX(secundarias,MATCH(EH9,ranking_premios,0)),0)","v":0},{"$f":"IFERROR(INDEX(secundarias,MATCH(EI9,ranking_premios,0)),0)","v":0},{"$f":"IFERROR(INDEX(secundarias,MATCH(EJ9,ranking_premios,0)),0)","v":0},{"$f":"IFERROR(INDEX(secundarias,MATCH(EK9,ranking_premios,0)),0)","v":0},{"$f":"IFERROR(INDEX(secundarias,MATCH(EL9,ranking_premios,0)),0)","v":0},{"$f":"IFERROR(INDEX(secundarias,MATCH(EM9,ranking_premios,0)),0)","v":0},{"$f":"IFERROR(INDEX(secundarias,MATCH(EN9,ranking_premios,0)),0)","v":0},{"$f":"IFERROR(INDEX(secundarias,MATCH(EO9,ranking_premios,0)),0)","v":0},{"$f":"IFERROR(INDEX(secundarias,MATCH(EP9,ranking_premios,0)),0)","v":0},{"$f":"IFERROR(INDEX(secundarias,MATCH(EQ9,ranking_premios,0)),0)","v":0},{"$f":"IFERROR(INDEX(secundarias,MATCH(ER9,ranking_premios,0)),0)","v":0},{"$f":"IFERROR(INDEX(secundarias,MATCH(ES9,ranking_premios,0)),0)","v":0},{"$f":"IFERROR(INDEX(secundarias,MATCH(ET9,ranking_premios,0)),0)","v":0},{"$f":"IFERROR(INDEX(secundarias,MATCH(EU9,ranking_premios,0)),0)","v":0},{"$f":"IFERROR(INDEX(secundarias,MATCH(EV9,ranking_premios,0)),0)","v":0},{"$f":"IFERROR(INDEX(secundarias,MATCH(EW9,ranking_premios,0)),0)","v":0},{"$f":"IFERROR(INDEX(secundarias,MATCH(EX9,ranking_premios,0)),0)","v":0},{"$f":"IFERROR(INDEX(secundarias,MATCH(EY9,ranking_premios,0)),0)","v":0},{"$f":"IFERROR(INDEX(secundarias,MATCH(EZ9,ranking_premios,0)),0)","v":0},{"$f":"IFERROR(INDEX(secundarias,MATCH(FA9,ranking_premios,0)),0)","v":0},{"$f":"IFERROR(INDEX(secundarias,MATCH(FB9,ranking_premios,0)),0)","v":0},{"$f":"IFERROR(INDEX(secundarias,MATCH(FC9,ranking_premios,0)),0)","v":0},{"$f":"IFERROR(INDEX(secundarias,MATCH(FD9,ranking_premios,0)),0)","v":0},{"$f":"IFERROR(INDEX(secundarias,MATCH(FE9,ranking_premios,0)),0)","v":0},{"$f":"IFERROR(INDEX(secundarias,MATCH(FF9,ranking_premios,0)),0)","v":0},{"$f":"IFERROR(INDEX(secundarias,MATCH(FG9,ranking_premios,0)),0)","v":0},{"$f":"IFERROR(INDEX(secundarias,MATCH(FH9,ranking_premios,0)),0)","v":0},{"$f":"IFERROR(INDEX(secundarias,MATCH(FI9,ranking_premios,0)),0)","v":0},{"$f":"IFERROR(INDEX(secundarias,MATCH(FJ9,ranking_premios,0)),0)","v":0},{"$f":"IFERROR(INDEX(secundarias,MATCH(FK9,ranking_premios,0)),0)","v":0},{"$f":"IFERROR(INDEX(secundarias,MATCH(FL9,ranking_premios,0)),0)","v":0},null,false,false,false,false,false,false,false,false,false,false,false,false,false,false,false,false,false,false,false,false,false,false,false,false,false,false,false,false,false,false,false,false,false,false,false,false,false,false,false,false,false,false,false,false,false,false,false,false,false,false,false,false,false,false,0]
[null,{"$f":"IF(Plantilla!D6<>0,Plantilla!D6,\"\")","v":"Daniel Martin"},null,null,null,null,null,null,null,null,null,null,null,null,null,null,null,null,null,null,null,null,null,null,null,null,null,null,null,null,null,null,null,null,null,null,null,null,null,null,null,null,null,null,null,null,null,null,null,null,null,null,null,null,null,null,null,0,"",0,0,0,0,0,0,0,0,0,0,0,0,0,0,0,0,0,0,0,0,0,0,0,0,0,0,0,0,0,0,0,0,0,0,0,0,0,0,0,0,0,0,0,0,0,0,0,0,0,0,0,0,0,0,null,false,false,false,false,false,false,false,false,false,false,false,false,false,false,false,false,false,false,false,false,false,false,false,false,false,false,false,false,false,false,false,false,false,false,false,false,false,false,false,false,false,false,false,false,false,false,false,false,false,false,false,false,false,false,0]
[null,{"$f":"IF(Plantilla!D7<>0,Plantilla!D7,\"\")","v":"José Joaquin Rojas"},null,null,null,null,null,null,null,null,null,null,null,null,null,null,null,null,null,null,null,null,null,null,null,null,null,null,null,null,null,null,null,null,null,null,null,null,null,null,null,null,null,null,null,null,null,null,null,null,null,null,null,null,null,null,null,0,"",0,0,0,0,0,0,0,0,0,0,0,0,0,0,0,0,0,0,0,0,0,0,0,0,0,0,0,0,0,0,0,0,0,0,0,0,0,0,0,0,0,0,0,0,0,0,0,0,0,0,0,0,0,0,null,false,false,false,false,false,false,false,false,false,false,false,false,false,false,false,false,false,false,false,false,false,false,false,false,false,false,false,false,false,false,false,false,false,false,false,false,false,false,false,false,false,false,false,false,false,false,false,false,false,false,false,false,false,false,0]
[null,{"$f":"IF(Plantilla!D8<>0,Plantilla!D8,\"\")","v":"Fran Ventoso"},null,null,null,null,null,null,null,null,null,null,null,null,null,null,null,null,null,null,null,null,null,null,null,null,null,null,null,null,null,null,null,null,null,null,null,null,null,null,null,null,null,null,null,null,null,null,null,null,null,null,null,null,null,null,null,0,"",0,0,0,0,0,0,0,0,0,0,0,0,0,0,0,0,0,0,0,0,0,0,0,0,0,0,0,0,0,0,0,0,0,0,0,0,0,0,0,0,0,0,0,0,0,0,0,0,0,0,0,0,0,0,null,false,false,false,false,false,false,false,false,false,false,false,false,false,false,false,false,false,false,false,false,false,false,false,false,false,false,false,false,false,false,false,false,false,false,false,false,false,false,false,false,false,false,false,false,false,false,false,false,false,false,false,false,false,false,0]
[null,{"$f":"IF(Plantilla!D9<>0,Plantilla!D9,\"\")","v":"Rui Costa"},null,null,null,null,null,null,null,null,null,null,null,null,null,null,null,null,null,null,null,null,null,null,null,null,null,null,null,null,null,null,null,null,null,null,null,null,null,null,null,null,null,null,null,null,null,null,null,null,null,null,null,null,null,null,null,0,"",0,0,0,0,0,0,0,0,0,0,0,0,0,0,0,0,0,0,0,0,0,0,0,0,0,0,0,0,0,0,0,0,0,0,0,0,0,0,0,0,0,0,0,0,0,0,0,0,0,0,0,0,0,0,null,false,false,false,false,false,false,false,false,false,false,false,false,false,false,false,false,false,false,false,false,false,false,false,false,false,false,false,false,false,false,false,false,false,false,false,false,false,false,false,false,false,false,false,false,false,false,false,false,false,false,false,false,false,false,0]
[null,{"$f":"IF(Plantilla!D10<>0,Plantilla!D10,\"\")","v":"Christopher Sutton"},null,null,null,null,null,null,null,null,null,null,null,null,null,null,null,null,null,null,null,null,null,null,null,null,null,null,null,null,null,null,null,null,null,null,null,null,null,null,null,null,null,null,null,null,null,null,null,null,null,null,null,null,null,null,null,0,"",0,0,0,0,0,0,0,0,0,0,0,0,0,0,0,0,0,0,0,0,0,0,0,0,0,0,0,0,0,0,0,0,0,0,0,0,0,0,0,0,0,0,0,0,0,0,0,0,0,0,0,0,0,0,null,false,false,false,false,false,false,false,false,false,false,false,false,false,false,false,false,false,false,false,false,false,false,false,false,false,false,false,false,false,false,false,false,false,false,false,false,false,false,false,false,false,false,false,false,false,false,false,false,false,false,false,false,false,false,0]
[null,{"$f":"IF(Plantilla!D11<>0,Plantilla!D11,\"\")","v":"Vladimir Karpets"},null,null,null,null,null,null,null,null,null,null,null,null,null,null,null,null,null,null,null,null,null,null,null,null,null,null,null,null,null,null,null,null,null,null,null,null,null,null,null,null,null,null,null,null,null,null,null,null,null,null,null,null,null,null,null,0,"",0,0,0,0,0,0,0,0,0,0,0,0,0,0,0,0,0,0,0,0,0,0,0,0,0,0,0,0,0,0,0,0,0,0,0,0,0,0,0,0,0,0,0,0,0,0,0,0,0,0,0,0,0,0,null,false,false,false,false,false,false,false,false,false,false,false,false,false,false,false,false,false,false,false,false,false,false,false,false,false,false,false,false,false,false,false,false,false,false,false,false,false,false,false,false,false,false,false,false,false,false,false,false,false,false,false,false,false,false,0]
[null,{"$f":"IF(Plantilla!D12<>0,Plantilla!D12,\"\")","v":"Julian Dean"},null,null,null,null,null,null,null,null,null,null,null,null,null,null,null,null,null,null,null,null,null,null,null,null,null,null,null,null,null,null,null,null,null,null,null,null,null,null,null,null,null,null,null,null,null,null,null,null,null,null,null,null,null,null,null,0,"",0,0,0,0,0,0,0,0,0,0,0,0,0,0,0,0,0,0,0,0,0,0,0,0,0,0,0,0,0,0,0,0,0,0,0,0,0,0,0,0,0,0,0,0,0,0,0,0,0,0,0,0,0,0,null,false,false,false,false,false,false,false,false,false,false,false,false,false,false,false,false,false,false,false,false,false,false,false,false,false,false,false,false,false,false,false,false,false,false,false,false,false,false,false,false,false,false,false,false,false,false,false,false,false,false,false,false,false,false,0]
[null,{"$f":"IF(Plantilla!D13<>0,Plantilla!D13,\"\")","v":"Andreas Klier"},null,null,null,null,null,null,null,null,null,null,null,null,null,null,null,null,null,null,null,null,null,null,null,null,null,null,null,null,null,null,null,null,null,null,null,null,null,null,null,null,null,null,null,null,null,null,null,null,null,null,null,null,null,null,null,0,"",0,0,0,0,0,0,0,0,0,0,0,0,0,0,0,0,0,0,0,0,0,0,0,0,0,0,0,0,0,0,0,0,0,0,0,0,0,0,0,0,0,0,0,0,0,0,0,0,0,0,0,0,0,0,null,false,false,false,false,false,false,false,false,false,false,false,false,false,false,false,false,false,false,false,false,false,false,false,false,false,false,false,false,false,false,false,false,false,false,false,false,false,false,false,false,false,false,false,false,false,false,false,false,false,false,false,false,false,false,0]
[null,{"$f":"IF(Plantilla!D14<>0,Plantilla!D14,\"\")","v":"Elia Viviani"},null,null,null,null,null,null,null,null,null,null,null,null,null,null,null,null,null,null,null,null,null,null,null,null,null,null,null,null,null,null,null,null,null,null,null,null,null,null,null,null,null,null,null,null,null,null,null,null,null,null,null,null,null,null,null,0,"",0,0,0,0,0,0,0,0,0,0,0,0,0,0,0,0,0,0,0,0,0,0,0,0,0,0,0,0,0,0,0,0,0,0,0,0,0,0,0,0,0,0,0,0,0,0,0,0,0,0,0,0,0,0,null,false,false,false,false,false,false,false,false,false,false,false,false,false,false,false,false,false,false,false,false,false,false,false,false,false,false,false,false,false,false,false,false,false,false,false,false,false,false,false,false,false,false,false,false,false,false,false,false,false,false,false,false,false,false,0]
[null,{"$f":"IF(Plantilla!D15<>0,Plantilla!D15,\"\")","v":"Daniel Navarro"},null,null,null,null,null,null,null,null,null,null,null,null,null,null,null,null,null,null,null,null,null,null,null,null,null,null,null,null,null,null,null,null,null,null,null,null,null,null,null,null,null,null,null,null,null,null,null,null,null,null,null,null,null,null,null,0,"",0,0,0,0,0,0,0,0,0,0,0,0,0,0,0,0,0,0,0,0,0,0,0,0,0,0,0,0,0,0,0,0,0,0,0,0,0,0,0,0,0,0,0,0,0,0,0,0,0,0,0,0,0,0,null,false,false,false,false,false,false,false,false,false,false,false,false,false,false,false,false,false,false,false,false,false,false,false,false,false,false,false,false,false,false,false,false,false,false,false,false,false,false,false,false,false,false,false,false,false,false,false,false,false,false,false,false,false,false,0]
[null,{"$f":"IF(Plantilla!D20<>0,Plantilla!D20,\"\")","v":"Jure Kocjan"},null,null,null,null,null,null,null,null,null,null,null,null,null,null,null,null,null,null,null,null,null,null,null,null,null,null,null,null,null,null,null,null,null,null,null,null,null,null,null,null,null,null,null,null,null,null,null,null,null,null,null,null,null,null,null,0,"",0,0,0,0,0,0,0,0,0,0,0,0,0,0,0,0,0,0,0,0,0,0,0,0,0,0,0,0,0,0,0,0,0,0,0,0,0,0,0,0,0,0,0,0,0,0,0,0,0,0,0,0,0,0,null,false,false,false,false,false,false,false,false,false,false,false,false,false,false,false,false,false,false,false,false,false,false,false,false,false,false,false,false,false,false,false,false,false,false,false,false,false,false,false,false,false,false,false,false,false,false,false,false,false,false,false,false,false,false,0]
[null,{"$f":"IF(Plantilla!D21<>0,Plantilla!D21,\"\")","v":"Przemyslaw Niemiec"},null,null,null,null,null,null,null,null,null,null,null,null,null,null,null,null,null,null,null,null,null,null,null,null,null,null,null,null,null,null,null,null,null,null,null,null,null,null,null,null,null,null,null,null,null,null,null,null,null,null,null,null,null,null,null,0,"",0,0,0,0,0,0,0,0,0,0,0,0,0,0,0,0,0,0,0,0,0,0,0,0,0,0,0,0,0,0,0,0,0,0,0,0,0,0,0,0,0,0,0,0,0,0,0,0,0,0,0,0,0,0,null,false,false,false,false,false,false,false,false,false,false,false,false,false,false,false,false,false,false,false,false,false,false,false,false,false,false,false,false,false,false,false,false,false,false,false,false,false,false,false,false,false,false,false,false,false,false,false,false,false,false,false,false,false,false,0]
[null,{"$f":"IF(Plantilla!D22<>0,Plantilla!D22,\"\")","v":"Sergio Paulinho"},null,null,null,null,null,null,null,null,null,null,null,null,null,null,null,null,null,null,null,null,null,null,null,null,null,null,null,null,null,null,null,null,null,null,null,null,null,null,null,null,null,null,null,null,null,null,null,null,null,null,null,null,null,null,null,0,"",0,0,0,0,0,0,0,0,0,0,0,0,0,0,0,0,0,0,0,0,0,0,0,0,0,0,0,0,0,0,0,0,0,0,0,0,0,0,0,0,0,0,0,0,0,0,0,0,0,0,0,0,0,0,null,false,false,false,false,false,false,false,false,false,false,false,false,false,false,false,false,false,false,false,false,false,false,false,false,false,false,false,false,false,false,false,false,false,false,false,false,false,false,false,false,false,false,false,false,false,false,false,false,false,false,false,false,false,false,0]
[null,{"$f":"IF(Plantilla!D19<>0,Plantilla!D19,\"\")","v":"Fabio Sabatini"},null,null,null,null,null,null,null,null,null,null,null,null,null,null,null,null,null,null,null,null,null,null,null,null,null,null,null,null,null,null,null,null,null,null,null,null,null,null,null,null,null,null,null,null,null,null,null,null,null,null,null,null,null,null,null,0,"",0,0,0,0,0,0,0,0,0,0,0,0,0,0,0,0,0,0,0,0,0,0,0,0,0,0,0,0,0,0,0,0,0,0,0,0,0,0,0,0,0,0,0,0,0,0,0,0,0,0,0,0,0,0,null,false,false,false,false,false,false,false,false,false,false,false,false,false,false,false,false,false,false,false,false,false,false,false,false,false,false,false,false,false,false,false,false,false,false,false,false,false,false,false,false,false,false,false,false,false,false,false,false,false,false,false,false,false,false,0]
[null,{"$f":"IF(Plantilla!D16<>0,Plantilla!D16,\"\")","v":"Johann Tschopp"},null,null,null,null,null,null,null,null,null,null,null,null,null,null,null,null,null,null,null,null,null,null,null,null,null,null,null,null,null,null,null,null,null,null,null,null,null,null,null,null,null,null,null,null,null,null,null,null,null,null,null,null,null,null,null,0,"",0,0,0,0,0,0,0,0,0,0,0,0,0,0,0,0,0,0,0,0,0,0,0,0,0,0,0,0,0,0,0,0,0,0,0,0,0,0,0,0,0,0,0,0,0,0,0,0,0,0,0,0,0,0,null,false,false,false,false,false,false,false,false,false,false,false,false,false,false,false,false,false,false,false,false,false,false,false,false,false,false,false,false,false,false,false,false,false,false,false,false,false,false,false,false,false,false,false,false,false,false,false,false,false,false,false,false,false,false,0]
[null,{"$f":"IF(Plantilla!D17<>0,Plantilla!D17,\"\")","v":"Miguel A. Ubeto"},null,null,null,null,null,null,null,null,null,null,null,null,null,null,null,null,null,null,null,null,null,null,null,null,null,null,null,null,null,null,null,null,null,null,null,null,null,null,null,null,null,null,null,null,null,null,null,null,null,null,null,null,null,null,null,0,"",0,0,0,0,0,0,0,0,0,0,0,0,0,0,0,0,0,0,0,0,0,0,0,0,0,0,0,0,0,0,0,0,0,0,0,0,0,0,0,0,0,0,0,0,0,0,0,0,0,0,0,0,0,0,null,false,false,false,false,false,false,false,false,false,false,false,false,false,false,false,false,false,false,false,false,false,false,false,false,false,false,false,false,false,false,false,false,false,false,false,false,false,false,false,false,false,false,false,false,false,false,false,false,false,false,false,false,false,false,0]
[null,{"$f":"IF(Plantilla!D18<>0,Plantilla!D18,\"\")","v":"Tom-Jelte Slagter"},null,null,null,null,null,null,null,null,null,null,null,null,null,null,null,null,null,null,null,null,null,null,null,null,null,null,null,null,null,null,null,null,null,null,null,null,null,null,null,null,null,null,null,null,null,null,null,null,null,null,null,null,null,null,null,0,"",0,0,0,0,0,0,0,0,0,0,0,0,0,0,0,0,0,0,0,0,0,0,0,0,0,0,0,0,0,0,0,0,0,0,0,0,0,0,0,0,0,0,0,0,0,0,0,0,0,0,0,0,0,0,null,false,false,false,false,false,false,false,false,false,false,false,false,false,false,false,false,false,false,false,false,false,false,false,false,false,false,false,false,false,false,false,false,false,false,false,false,false,false,false,false,false,false,false,false,false,false,false,false,false,false,false,false,false,false,0]
[null,{"$f":"IF(Plantilla!D23<>0,Plantilla!D23,\"\")","v":""},null,null,null,null,null,null,null,null,null,null,null,null,null,null,null,null,null,null,null,null,null,null,null,null,null,null,null,null,null,null,null,null,null,null,null,null,null,null,null,null,null,null,null,null,null,null,null,null,null,null,null,null,null,null,null,0,"",0,0,0,0,0,0,0,0,0,0,0,0,0,0,0,0,0,0,0,0,0,0,0,0,0,0,0,0,0,0,0,0,0,0,0,0,0,0,0,0,0,0,0,0,0,0,0,0,0,0,0,0,0,0,null,false,false,false,false,false,false,false,false,false,false,false,false,false,false,false,false,false,false,false,false,false,false,false,false,false,false,false,false,false,false,false,false,false,false,false,false,false,false,false,false,false,false,false,false,false,false,false,false,false,false,false,false,false,false,0]
[null,{"$f":"IF(Plantilla!D24<>0,Plantilla!D24,\"\")","v":""},null,null,null,null,null,null,null,null,null,null,null,null,null,null,null,null,null,null,null,null,null,null,null,null,null,null,null,null,null,null,null,null,null,null,null,null,null,null,null,null,null,null,null,null,null,null,null,null,null,null,null,null,null,null,null,0,"",0,0,0,0,0,0,0,0,0,0,0,0,0,0,0,0,0,0,0,0,0,0,0,0,0,0,0,0,0,0,0,0,0,0,0,0,0,0,0,0,0,0,0,0,0,0,0,0,0,0,0,0,0,0,null,false,false,false,false,false,false,false,false,false,false,false,false,false,false,false,false,false,false,false,false,false,false,false,false,false,false,false,false,false,false,false,false,false,false,false,false,false,false,false,false,false,false,false,false,false,false,false,false,false,false,false,false,false,false,0]
[null,{"$f":"IF(Plantilla!D25<>0,Plantilla!D25,\"\")","v":""},null,null,null,null,null,null,null,null,null,null,null,null,null,null,null,null,null,null,null,null,null,null,null,null,null,null,null,null,null,null,null,null,null,null,null,null,null,null,null,null,null,null,null,null,null,null,null,null,null,null,null,null,null,null,null,0,"",0,0,0,0,0,0,0,0,0,0,0,0,0,0,0,0,0,0,0,0,0,0,0,0,0,0,0,0,0,0,0,0,0,0,0,0,0,0,0,0,0,0,0,0,0,0,0,0,0,0,0,0,0,0,null,false,false,false,false,false,false,false,false,false,false,false,false,false,false,false,false,false,false,false,false,false,false,false,false,false,false,false,false,false,false,false,false,false,false,false,false,false,false,false,false,false,false,false,false,false,false,false,false,false,false,false,false,false,false,0]
[null,{"$f":"IF(Plantilla!D26<>0,Plantilla!D26,\"\")","v":""},null,null,null,null,null,null,null,null,null,null,null,null,null,null,null,null,null,null,null,null,null,null,null,null,null,null,null,null,null,null,null,null,null,null,null,null,null,null,null,null,null,null,null,null,null,null,null,null,null,null,null,null,null,null,null,0,"",0,0,0,0,0,0,0,0,0,0,0,0,0,0,0,0,0,0,0,0,0,0,0,0,0,0,0,0,0,0,0,0,0,0,0,0,0,0,0,0,0,0,0,0,0,0,0,0,0,0,0,0,0,0,null,false,false,false,false,false,false,false,false,false,false,false,false,false,false,false,false,false,false,false,false,false,false,false,false,false,false,false,false,false,false,false,false,false,false,false,false,false,false,false,false,false,false,false,false,false,false,false,false,false,false,false,false,false,false,0]
[null,{"$f":"IF(Plantilla!D27<>0,Plantilla!D27,\"\")","v":""},null,null,null,null,null,null,null,null,null,null,null,null,null,null,null,null,null,null,null,null,null,null,null,null,null,null,null,null,null,null,null,null,null,null,null,null,null,null,null,null,null,null,null,null,null,null,null,null,null,null,null,null,null,null,null,0,"",0,0,0,0,0,0,0,0,0,0,0,0,0,0,0,0,0,0,0,0,0,0,0,0,0,0,0,0,0,0,0,0,0,0,0,0,0,0,0,0,0,0,0,0,0,0,0,0,0,0,0,0,0,0,null,false,false,false,false,false,false,false,false,false,false,false,false,false,false,false,false,false,false,false,false,false,false,false,false,false,false,false,false,false,false,false,false,false,false,false,false,false,false,false,false,false,false,false,false,false,false,false,false,false,false,false,false,false,false,0]
[null,{"$f":"IF(Plantilla!D28<>0,Plantilla!D28,\"\")","v":""},null,null,null,null,null,null,null,null,null,null,null,null,null,null,null,null,null,null,null,null,null,null,null,null,null,null,null,null,null,null,null,null,null,null,null,null,null,null,null,null,null,null,null,null,null,null,null,null,null,null,null,null,null,null,null,0,"",0,0,0,0,0,0,0,0,0,0,0,0,0,0,0,0,0,0,0,0,0,0,0,0,0,0,0,0,0,0,0,0,0,0,0,0,0,0,0,0,0,0,0,0,0,0,0,0,0,0,0,0,0,0,null,false,false,false,false,false,false,false,false,false,false,false,false,false,false,false,false,false,false,false,false,false,false,false,false,false,false,false,false,false,false,false,false,false,false,false,false,false,false,false,false,false,false,false,false,false,false,false,false,false,false,false,false,false,false,0]
[null,{"$f":"IF(Plantilla!D29<>0,Plantilla!D29,\"\")","v":""},null,null,null,null,null,null,null,null,null,null,null,null,null,null,null,null,null,null,null,null,null,null,null,null,null,null,null,null,null,null,null,null,null,null,null,null,null,null,null,null,null,null,null,null,null,null,null,null,null,null,null,null,null,null,null,0,"",0,0,0,0,0,0,0,0,0,0,0,0,0,0,0,0,0,0,0,0,0,0,0,0,0,0,0,0,0,0,0,0,0,0,0,0,0,0,0,0,0,0,0,0,0,0,0,0,0,0,0,0,0,0,null,false,false,false,false,false,false,false,false,false,false,false,false,false,false,false,false,false,false,false,false,false,false,false,false,false,false,false,false,false,false,false,false,false,false,false,false,false,false,false,false,false,false,false,false,false,false,false,false,false,false,false,false,false,false,0]
[null,{"$f":"IF(Plantilla!D30<>0,Plantilla!D30,\"\")","v":""},null,null,null,null,null,null,null,null,null,null,null,null,null,null,null,null,null,null,null,null,null,null,null,null,null,null,null,null,null,null,null,null,null,null,null,null,null,null,null,null,null,null,null,null,null,null,null,null,null,null,null,null,null,null,null,0,"",0,0,0,0,0,0,0,0,0,0,0,0,0,0,0,0,0,0,0,0,0,0,0,0,0,0,0,0,0,0,0,0,0,0,0,0,0,0,0,0,0,0,0,0,0,0,0,0,0,0,0,0,0,0,null,false,false,false,false,false,false,false,false,false,false,false,false,false,false,false,false,false,false,false,false,false,false,false,false,false,false,false,false,false,false,false,false,false,false,false,false,false,false,false,false,false,false,false,false,false,false,false,false,false,false,false,false,false,false,0]
[null,{"$f":"IF(Plantilla!D31<>0,Plantilla!D31,\"\")","v":""},null,null,null,null,null,null,null,null,null,null,null,null,null,null,null,null,null,null,null,null,null,null,null,null,null,null,null,null,null,null,null,null,null,null,null,null,null,null,null,null,null,null,null,null,null,null,null,null,null,null,null,null,null,null,null,0,"",0,0,0,0,0,0,0,0,0,0,0,0,0,0,0,0,0,0,0,0,0,0,0,0,0,0,0,0,0,0,0,0,0,0,0,0,0,0,0,0,0,0,0,0,0,0,0,0,0,0,0,0,0,0,null,false,false,false,false,false,false,false,false,false,false,false,false,false,false,false,false,false,false,false,false,false,false,false,false,false,false,false,false,false,false,false,false,false,false,false,false,false,false,false,false,false,false,false,false,false,false,false,false,false,false,false,false,false,false,0]
[null,{"$f":"IF(Plantilla!D32<>0,Plantilla!D32,\"\")","v":""},null,null,null,null,null,null,null,null,null,null,null,null,null,null,null,null,null,null,null,null,null,null,null,null,null,null,null,null,null,null,null,null,null,null,null,null,null,null,null,null,null,null,null,null,null,null,null,null,null,null,null,null,null,null,null,0,"",0,0,0,0,0,0,0,0,0,0,0,0,0,0,0,0,0,0,0,0,0,0,0,0,0,0,0,0,0,0,0,0,0,0,0,0,0,0,0,0,0,0,0,0,0,0,0,0,0,0,0,0,0,0,null,false,false,false,false,false,false,false,false,false,false,false,false,false,false,false,false,false,false,false,false,false,false,false,false,false,false,false,false,false,false,false,false,false,false,false,false,false,false,false,false,false,false,false,false,false,false,false,false,false,false,false,false,false,false,0]
[null,{"$f":"IF(Plantilla!D33<>0,Plantilla!D33,\"\")","v":""},null,null,null,null,null,null,null,null,null,null,null,null,null,null,null,null,null,null,null,null,null,null,null,null,null,null,null,null,null,null,null,null,null,null,null,null,null,null,null,null,null,null,null,null,null,null,null,null,null,null,null,null,null,null,null,0,"",0,0,0,0,0,0,0,0,0,0,0,0,0,0,0,0,0,0,0,0,0,0,0,0,0,0,0,0,0,0,0,0,0,0,0,0,0,0,0,0,0,0,0,0,0,0,0,0,0,0,0,0,0,0,null,false,false,false,false,false,false,false,false,false,false,false,false,false,false,false,false,false,false,false,false,false,false,false,false,false,false,false,false,false,false,false,false,false,false,false,false,false,false,false,false,false,false,false,false,false,false,false,false,false,false,false,false,false,false,0]
[null,{"$f":"'Consulta Corredor'!B2","v":"Samuel Sánchez"},{"$f":"INDEX(C7:C37,MATCH($B$38,corredores,0))","v":0},0,0,0,0,0,0,0,0,0,0,0,0,0,0,0,0,0,0,0,0,0,0,0,0,0,0,0,0,0,0,0,{"$f":"INDEX(AI7:AI37,MATCH($B$38,corredores,0))","v":0},0,0,0,0,0,0,0,0,0,0,0,0,0,0,0,0,0,0,0,0,0,null,null,null,null,null,null,null,null,null,null,null,null,null,null,null,null,null,null,null,null,null,null,null,null,null,null,null,null,null,null,null,null,null,null,null,null,null,null,null,null,null,null,null,null,null,null,null,null,null,null,null,null,null,null,null,null,null,null,"0 0","0 0","2.HC 0","1.UWT 0","1.1 0","1.UWT 0","1.HC 0","1.HC 0","1.UWT 0","1.1 0","2.UWT 0","1.HC 0","1.HC 0","1.UWT 0","2.UWT 0","GV 0","1.1 0","1.1 0","2.HC 0","2.1 0","1.1 0","1.HC 0","1.UWT 0","1.HC 0","WC TTT 0","WC ITT 0","WC RR 0","TC 0","TC 0","PC 0","PV 0","TC 0","CN 0","CN 0","CN 0","CN 0","CN 0","CN 0","CN 0","CN 0","CN 0","CN 0","TC 0","GC 0","GV 0","TC 0","PV 0","TV 0","PC 0","PC 0","MC 0","MCE 0","MCI 0","0 0"]
[null,null,{"$f":"IF(C38<>0,C2,\"\")","v":""},{"$f":"IF(D38<>0,D2,\"\")","v":""},"","","","","","","","","","","","","","","","","","","","","","","","","","","","","","","","","","","","","","","","","","","","","","","","","","","","",null,null,null,null,null,null,null,null,null,null,null,null,null,null,null,null,null,null,null,null,null,null,null,null,null,null,null,null,null,null,null,null,null,null,null,null,null,null,null,null,null,null,null,null,null,null,null,null,null,null,null,null,null,null,null,null,null,null,false,false,false,false,false,false,false,false,false,false,false,false,false,false,false,false,false,false,false,false,false,false,false,false,false,false,false,false,false,false,false,false,false,false,false,false,false,false,false,false,false,false,false,false,false,false,false,false,false,false,false,false,false,false]
[null,null,{"$f":"IF(C38=1,C3,\"\")","v":""},"","","","","","","","","","","","","","","","","","","","","","","","","","","","","","","","","","","","","","","","","","","","","","","","","","","","","",null,null,null,null,null,null,null,null,null,null,null,null,null,null,null,null,null,null,null,null,null,null,null,null,null,null,null,null,null,null,null,null,null,null,null,null,null,null,null,null,null,null,null,null,null,null,null,null,null,null,null,null,null,null,null,null,null,null,false,false,false,false,false,false,false,false,false,false,false,false,false,false,false,false,false,false,false,false,false,false,false,false,false,false,false,false,false,false,false,false,false,false,false,false,false,false,false,false,false,false,false,false,false,false,false,false,false,false,false,false,false,false]
[null,{"$f":"IF(Plantilla!C36<>0,Plantilla!C36,\"\")","v":"Totales"},{"$f":"BH41","v":0},{"$f":"BI41","v":0},0,0,0,0,0,0,0,0,0,0,0,0,0,0,0,0,0,0,0,0,0,0,0,0,0,0,0,0,0,0,0,0,0,0,0,0,0,0,0,0,0,0,0,0,0,0,0,0,0,0,0,0,null,null,null,{"$f":"SUM(BH7:BH37)","v":0},{"$f":"SUM(BI7:BI37)","v":0},0,0,0,0,0,0,0,0,0,0,0,0,0,0,0,0,0,0,0,0,0,0,0,0,0,0,0,0,0,0,0,0,0,0,0,0,0,0,0,0,0,0,0,0,0,0,0,0,0,0,0,0,null,"Numero de carreras:",null,null,null,54,null,null,null,null,null,null,null,null,null,null,null,null,null,null,null,null,null,null,null,null,null,null,null,null,null,null,null,null,null,null,null,null,null,null,null,null,null,null,null,null,null,null,null,null,null,null,null,null,null,{"$f":"SUM(C41:BD41)","v":0}]
[null,{"$f":"IF(Plantilla!D38<>0,Plantilla!D38,\"\")","v":""}]

{"sheet":"Montana","index":9,"n_rows":42,"n_cols":169,"rows_kept":42,"cut":false,"hidden":false,"merged":[[4,168,5,168],[40,114,40,117]]}
[]
[null,null,{"$f":"Inscripciones!C1","v":"Campeonatos Nacionales ITT"},{"$f":"Inscripciones!D1","v":"Campeonatos Nacionales RR"},{"$f":"Inscripciones!E1","v":"Santos Tour Down Under"},{"$f":"Inscripciones!F1","v":"Milán-San Remo"},{"$f":"Inscripciones!G1","v":"Omloop"},{"$f":"Inscripciones!H1","v":"Tour de Flandres"},{"$f":"Inscripciones!I1","v":"E3 Prijs Vlaanderen-Harelbeke"},{"$f":"Inscripciones!J1","v":"Gent-Wevelgem"},{"$f":"Inscripciones!K1","v":"Paris-Roubaix"},{"$f":"Inscripciones!L1","v":"Strade Bianche"},{"$f":"Inscripciones!M1","v":"Paris-Niza"},{"$f":"Inscripciones!N1","v":"Amstel Gold Race"},{"$f":"Inscripciones!O1","v":"Flecha Valona"},{"$f":"Inscripciones!P1","v":"Lieja-Bastoña-Lieja"},{"$f":"Inscripciones!Q1","v":"Dauphiné Libéré"},{"$f":"Inscripciones!R1","v":"Tour de France"},{"$f":"Inscripciones!S1","v":"Chrono des Nations"},{"$f":"Inscripciones!T1","v":"GP du Québec"},{"$f":"Inscripciones!U1","v":"Vuelta al País Vasco"},{"$f":"Inscripciones!V1","v":"Critérium International"},{"$f":"Inscripciones!W1","v":"Hamburguer Turn"},{"$f":"Inscripciones!X1","v":"GP de Montréal"},{"$f":"Inscripciones!Y1","v":"GP de Lombardía"},{"$f":"Inscripciones!Z1","v":"Clásica San Sebastián"},{"$f":"Inscripciones!AA1","v":"Campeonatos del Mundo: Contrarreloj por Equipos"},{"$f":"Inscripciones!AB1","v":"Campeonatos del Mundo: Contrarreloj Individual "},{"$f":"Inscripciones!AC1","v":"Campeonatos del Mundo en Ruta"},"Paris-Roubaix (1 Día) -- GC","Grand Prix Cycliste de Montreal (1 Dia) -- TC","Ronde van Drenthe (1 Dia) -- PC","Vuelta a Burgos (5 Dias) -- PV","Paris - Bruxelles (1 Dia) -- TC","CN Sur de Europa: Contrarreloj Individual (1 Dia) CN","CN Este de Europa: Contrarreloj Individual (1 Dia) CN","CN Norte de Europa: Contrarreloj Individual (1 Dia) CN","CN America: Contrarreloj Individual (1 Dia) CN","CN Resto del Mundo: Contrarreloj Individual (1 Dia) CN","CN Sur de Europa: Ruta en Carretera (1 Dia) CN","CN Este de Europa: Ruta en Carretera (1 Dia) CN","CN Norte de Europa: Ruta en Carretera (1 Dia) CN","CN America: Ruta en Carretera (1 Dia) CN","CN Resto del Mundo: Ruta en Carretera (1 Dia) CN","Milano - Torino (1 Dia) -- TC","Il Lombardía - Clasica de Lombardia (1 Día) -- GC","Vuelta españa (21 Dias) -- GV","Flèche Brabançonne (1 Día) -- TC","Giro del Trentino (4 Dias) -- PV","Tour of Beijing (5 Dias) -- TV","Chrono des Nations (1 Día) -- PC","Japan Cup (1 Dia) -- PC","Gante-Wevelgen (1 Día) -- MC","Campeonatos del Mundo: Contrarreloj por Equipos (1 Día) -- MCE","Campeonatos del Mundo: Contrarreloj Individual (1 Día) -- MCI","Campeonatos del Mundo: Ruta en Carretera (1 Día) -- MRC",null,{"$f":"'Consulta de Inscripciones'!B2","v":"Santos Tour Down Under"},null,{"$f":"C2","v":"Campeonatos Nacionales ITT"},"Campeonatos Nacionales RR","Santos Tour Down Under","Milán-San Remo","Omloop","Tour de Flandres","E3 Prijs Vlaanderen-Harelbeke","Gent-Wevelgem","Paris-Roubaix","Strade Bianche","Paris-Niza","Amstel Gold Race","Flecha Valona","Lieja-Bastoña-Lieja","Dauphiné Libéré","Tour de France","Chrono des Nations","GP du Québec","Vuelta al País Vasco","Critérium International","Hamburguer Turn","GP de Montréal","GP de Lombardía","Clásica San Sebastián","Campeonatos del Mundo: Contrarreloj por Equipos","Campeonatos del Mundo: Contrarreloj Individual ","Campeonatos del Mundo en Ruta","Paris-Roubaix (1 Día) -- GC","Grand Prix Cycliste de Montreal (1 Dia) -- TC","Ronde van Drenthe (1 Dia) -- PC","Vuelta a Burgos (5 Dias) -- PV","Paris - Bruxelles (1 Dia) -- TC","CN Sur de Europa: Contrarreloj Individual (1 Dia) CN","CN Este de Europa: Contrarreloj Individual (1 Dia) CN","CN Norte de Europa: Contrarreloj Individual (1 Dia) CN","CN America: Contrarreloj Individual (1 Dia) CN","CN Resto del Mundo: Contrarreloj Individual (1 Dia) CN","CN Sur de Europa: Ruta en Carretera (1 Dia) CN","CN Este de Europa: Ruta en Carretera (1 Dia) CN","CN Norte de Europa: Ruta en Carretera (1 Dia) CN","CN America: Ruta en Carretera (1 Dia) CN","CN Resto del Mundo: Ruta en Carretera (1 Dia) CN","Milano - Torino (1 Dia) -- TC","Il Lombardía - Clasica de Lombardia (1 Día) -- GC","Vuelta españa (21 Dias) -- GV","Flèche Brabançonne (1 Día) -- TC","Giro del Trentino (4 Dias) -- PV","Tour of Beijing (5 Dias) -- TV","Chrono des Nations (1 Día) -- PC","Japan Cup (1 Dia) -- PC","Gante-Wevelgen (1 Día) -- MC","Campeonatos del Mundo: Contrarreloj por Equipos (1 Día) -- MCE","Campeonatos del Mundo: Contrarreloj Individual (1 Día) -- MCI","Campeonatos del Mundo: Ruta en Carretera (1 Día) -- MRC",null,{"$f":"C2","v":"Campeonatos Nacionales ITT"},"Campeonatos Nacionales RR","Santos Tour Down Under","Milán-San Remo","Omloop","Tour de Flandres","E3 Prijs Vlaanderen-Harelbeke","Gent-Wevelgem","Paris-Roubaix","Strade Bianche","Paris-Niza","Amstel Gold Race","Flecha Valona","Lieja-Bastoña-Lieja","Dauphiné Libéré","Tour de France","Chrono des Nations","GP du Québec","Vuelta al País Vasco","Critérium International","Hamburguer Turn","GP de Montréal","GP de Lombardía","Clásica San Sebastián","Campeonatos del Mundo: Contrarreloj por Equipos","Campeonatos del Mundo: Contrarreloj Individual ","Campeonatos del Mundo en Ruta","Paris-Roubaix (1 Día) -- GC","Grand Prix Cycliste de Montreal (1 Dia) -- TC","Ronde van Drenthe (1 Dia) -- PC","Vuelta a Burgos (5 Dias) -- PV","Paris - Bruxelles (1 Dia) -- TC","CN Sur de Europa: Contrarreloj Individual (1 Dia) CN","CN Este de Europa: Contrarreloj Individual (1 Dia) CN","CN Norte de Europa: Contrarreloj Individual (1 Dia) CN","CN America: Contrarreloj Individual (1 Dia) CN","CN Resto del Mundo: Contrarreloj Individual (1 Dia) CN","CN Sur de Europa: Ruta en Carretera (1 Dia) CN","CN Este de Europa: Ruta en Carretera (1 Dia) CN","CN Norte de Europa: Ruta en Carretera (1 Dia) CN","CN America: Ruta en Carretera (1 Dia) CN","CN Resto del Mundo: Ruta en Carretera (1 Dia) CN","Milano - Torino (1 Dia) -- TC","Il Lombardía - Clasica de Lombardia (1 Día) -- GC","Vuelta españa (21 Dias) -- GV","Flèche Brabançonne (1 Día) -- TC","Giro del Trentino (4 Dias) -- PV","Tour of Beijing (5 Dias) -- TV","Chrono des Nations (1 Día) -- PC","Japan Cup (1 Dia) -- PC","Gante-Wevelgen (1 Día) -- MC","Campeonatos del Mundo: Contrarreloj por Equipos (1 Día) -- MCE","Campeonatos del Mundo: Contrarreloj Individual (1 Día) -- MCI","Campeonatos del Mundo: Ruta en Carretera (1 Día) -- MRC"]
[null,"Días",{"$f":"Inscripciones!C2","v":1},{"$f":"Inscripciones!D2","v":1},{"$f":"Inscripciones!E2","v":6},{"$f":"Inscripciones!F2","v":1},{"$f":"Inscripciones!G2","v":1},{"$f":"Inscripciones!H2","v":1},{"$f":"Inscripciones!I2","v":1},{"$f":"Inscripciones!J2","v":1},{"$f":"Inscripciones!K2","v":1},{"$f":"Inscripciones!L2","v":1},{"$f":"Inscripciones!M2","v":8},{"$f":"Inscripciones!N2","v":1},{"$f":"Inscripciones!O2","v":1},{"$f":"Inscripciones!P2","v":1},{"$f":"Inscripciones!Q2","v":8},{"$f":"Inscripciones!R2","v":21},{"$f":"Inscripciones!S2","v":1},{"$f":"Inscripciones!T2","v":1},{"$f":"Inscripciones!U2","v":6},{"$f":"Inscripciones!V2","v":3},{"$f":"Inscripciones!W2","v":1},{"$f":"Inscripciones!X2","v":1},{"$f":"Inscripciones!Y2","v":1},{"$f":"Inscripciones!Z2","v":1},{"$f":"Inscripciones!AA2","v":1},{"$f":"Inscripciones!AB2","v":1},{"$f":"Inscripciones!AC2","v":1},1,1,1,5,1,1,1,1,1,1,1,1,1,1,1,1,1,21,1,4,5,1,1,1,1,1,1]
[null,"Mes",{"$f":"Inscripciones!C3","v":"Ag"},{"$f":"Inscripciones!D3","v":"Ag"},{"$f":"Inscripciones!G3","v":"Ag"},{"$f":"Inscripciones!H3","v":"Ag"},{"$f":"Inscripciones!I3","v":"Ag"},{"$f":"Inscripciones!J3","v":"Ag"},{"$f":"Inscripciones!K3","v":"Ag"},{"$f":"Inscripciones!L3","v":"Ag"},{"$f":"Inscripciones!M3","v":"S"},{"$f":"Inscripciones!N3","v":"S"},{"$f":"Inscripciones!O3","v":"S"},{"$f":"Inscripciones!P3","v":"S"},{"$f":"Inscripciones!Q3","v":"S"},{"$f":"Inscripciones!R3","v":"O"},{"$f":"Inscripciones!S3","v":"O"},{"$f":"Inscripciones!T3","v":"O"},{"$f":"Inscripciones!U3","v":"O"},{"$f":"Inscripciones!V3","v":"O"},{"$f":"Inscripciones!W3","v":"O"},{"$f":"Inscripciones!X3","v":"O"},{"$f":"Inscripciones!Y3","v":"O"},{"$f":"Inscripciones!Z3","v":"N"},{"$f":"Inscripciones!AA3","v":"N"},{"$f":"Inscripciones!AC3","v":"N"},"N","N","N","My","My","My","My","My","My","My","My","My","My","My","My","My","My","My","My","My","J","J","J","J","J","J","J","J","J","J",null,"J","J",null,null,null,null,null,null,null,null,null,null,null,null,null,null,null,null,null,null,null,null,null,null,null,null,null,null,null,null,null,null,null,null,null,null,null,null,null,null,null,null,null,null,null,null,null,null,null,null,null,null,null,null,null,null,null,"J","J","J","J","J","J","J","J","J","J","J","J","J","J","J","J","J","J","J","J","J","J","J","J","J","J","J","J","J","J","J","J","J","J","J","J","J","J","J","J","J","J","J","J","J","J","J","J","J","J","J","J","J","J","Códigos"]
[null,"Tipo",{"$f":"Inscripciones!C4","v":0},{"$f":"Inscripciones!D4","v":0},{"$f":"Inscripciones!E4","v":"2.HC"},{"$f":"Inscripciones!F4","v":"1.UWT"},{"$f":"Inscripciones!G4","v":1.1000000000000001},{"$f":"Inscripciones!H4","v":"1.UWT"},{"$f":"Inscripciones!I4","v":"1.HC"},{"$f":"Inscripciones!J4","v":"1.HC"},{"$f":"Inscripciones!K4","v":"1.UWT"},{"$f":"Inscripciones!L4","v":1.1000000000000001},{"$f":"Inscripciones!M4","v":"2.UWT"},{"$f":"Inscripciones!N4","v":"1.HC"},{"$f":"Inscripciones!O4","v":"1.HC"},{"$f":"Inscripciones!P4","v":"1.UWT"},{"$f":"Inscripciones!Q4","v":"2.UWT"},{"$f":"Inscripciones!R4","v":"GV"},{"$f":"Inscripciones!S4","v":1.1000000000000001},{"$f":"Inscripciones!T4","v":1.1000000000000001},{"$f":"Inscripciones!U4","v":"2.HC"},{"$f":"Inscripciones!V4","v":2.1},{"$f":"Inscripciones!W4","v":1.1000000000000001},{"$f":"Inscripciones!X4","v":"1.HC"},{"$f":"Inscripciones!Y4","v":"1.UWT"},{"$f":"Inscripciones!Z4","v":"1.HC"},{"$f":"Inscripciones!AA4","v":"WC TTT"},{"$f":"Inscripciones!AB4","v":"WC ITT"},{"$f":"Inscripciones!AC4","v":"WC RR"},"TC","TC","PC","PV","TC","CN","CN","CN","CN","CN","CN","CN","CN","CN","CN","TC","GC","GV","TC","PV","TV","PC","PC","MC","MCE","MCI","MRC",null,null,null,null,null,null,null,null,null,null,null,null,null,null,null,null,null,null,null,null,null,null,null,null,null,null,null,null,null,null,null,null,null,null,null,null,null,null,null,null,null,null,null,null,null,null,null,null,null,null,null,null,null,null,null,null,null,null,{"$f":"C5","v":0},0,"2.HC","1.UWT",1.1000000000000001,"1.UWT","1.HC","1.HC","1.UWT",1.1000000000000001,"2.UWT","1.HC","1.HC","1.UWT","2.UWT","GV",1.1000000000000001,1.1000000000000001,"2.HC",2.1,1.1000000000000001,"1.HC","1.UWT","1.HC","WC TTT","WC ITT","WC RR","TC","TC","PC","PV","TC","CN","CN","CN","CN","CN","CN","CN","CN","CN","CN","TC","GC","GV","TC","PV","TV","PC","PC","MC","MCE","MCI","MRC","Cambiar los premios"]
[null,"Precio",{"$f":"Inscripciones!C5","v":0},{"$f":"Inscripciones!D5","v":0},{"$f":"Inscripciones!E5","v":8000},{"$f":"Inscripciones!F5","v":8000},{"$f":"Inscripciones!G5","v":1200},{"$f":"Inscripciones!H5","v":8000},{"$f":"Inscripciones!I5","v":4800},{"$f":"Inscripciones!J5","v":4800},{"$f":"Inscripciones!K5","v":8000},{"$f":"Inscripciones!L5","v":1200},{"$f":"Inscripciones!M5","v":8000},{"$f":"Inscripciones!N5","v":4800},{"$f":"Inscripciones!O5","v":4800},{"$f":"Inscripciones!P5","v":8000},{"$f":"Inscripciones!Q5","v":8000},{"$f":"Inscripciones!R5","v":100000},{"$f":"Inscripciones!S5","v":1200},{"$f":"Inscripciones!T5","v":1200},{"$f":"Inscripciones!U5","v":8000},{"$f":"Inscripciones!V5","v":1600},{"$f":"Inscripciones!W5","v":1200},{"$f":"Inscripciones!X5","v":4800},{"$f":"Inscripciones!Y5","v":8000},{"$f":"Inscripciones!Z5","v":4800},{"$f":"Inscripciones!AA5","v":2000},{"$f":"Inscripciones!AB5","v":2000},{"$f":"Inscripciones!AC5","v":6000},{"$f":"LOOKUP(AD5,Categorias,Precios)","v":6000},6000,6000,6000,6000,8000,8000,8000,8000,8000,8000,8000,8000,8000,8000,6000,8000,100000,6000,6000,6000,6000,6000,6000,6000,6000,6000]
[null,{"$f":"IF(Plantilla!D3<>0,Plantilla!D3,\"\")","v":"Vincenzo Nibali"},null,null,null,null,null,null,null,null,null,null,null,null,null,null,null,null,null,null,null,null,null,null,null,null,null,null,null,null,null,null,null,null,null,null,null,null,null,null,null,null,null,null,null,null,null,null,null,null,null,null,null,null,null,null,null,{"$f":"INDIRECT(ADDRESS(ROW(),MATCH($BF$2,carreras,0)+1))","v":0},{"$f":"IF(BF7=1,B7,\"\")","v":""},{"$f":"IFERROR(INDEX(secundarias,MATCH(DK7,ranking_premios,0)),0)","v":0},{"$f":"IFERROR(INDEX(secundarias,MATCH(DL7,ranking_premios,0)),0)","v":0},{"$f":"IFERROR(INDEX(secundarias,MATCH(DM7,ranking_premios,0)),0)","v":0},{"$f":"IFERROR(INDEX(secundarias,MATCH(DN7,ranking_premios,0)),0)","v":0},{"$f":"IFERROR(INDEX(secundarias,MATCH(DO7,ranking_premios,0)),0)","v":0},{"$f":"IFERROR(INDEX(secundarias,MATCH(DP7,ranking_premios,0)),0)","v":0},{"$f":"IFERROR(INDEX(secundarias,MATCH(DQ7,ranking_premios,0)),0)","v":0},{"$f":"IFERROR(INDEX(secundarias,MATCH(DR7,ranking_premios,0)),0)","v":0},{"$f":"IFERROR(INDEX(secundarias,MATCH(DS7,ranking_premios,0)),0)","v":0},{"$f":"IFERROR(INDEX(secundarias,MATCH(DT7,ranking_premios,0)),0)","v":0},{"$f":"IFERROR(INDEX(secundarias,MATCH(DU7,ranking_premios,0)),0)","v":0},{"$f":"IFERROR(INDEX(secundarias,MATCH(DV7,ranking_premios,0)),0)","v":0},{"$f":"IFERROR(INDEX(secundarias,MATCH(DW7,ranking_premios,0)),0)","v":0},{"$f":"IFERROR(INDEX(secundarias,MATCH(DX7,ranking_premios,0)),0)","v":0},{"$f":"IFERROR(INDEX(secundarias,MATCH(DY7,ranking_premios,0)),0)","v":0},{"$f":"IFERROR(INDEX(secundarias,MATCH(DZ7,ranking_premios,0)),0)","v":0},{"$f":"IFERROR(INDEX(secundarias,MATCH(EA7,ranking_premios,0)),0)","v":0},{"$f":"IFERROR(INDEX(secundarias,MATCH(EB7,ranking_premios,0)),0)","v":0},{"$f":"IFERROR(INDEX(secundarias,MATCH(EC7,ranking_premios,0)),0)","v":0},{"$f":"IFERROR(INDEX(secundarias,MATCH(ED7,ranking_premios,0)),0)","v":0},{"$f":"IFERROR(INDEX(secundarias,MATCH(EE7,ranking_premios,0)),0)","v":0},{"$f":"IFERROR(INDEX(secundarias,MATCH(EF7,ranking_premios,0)),0)","v":0},{"$f":"IFERROR(INDEX(secundarias,MATCH(EG7,ranking_premios,0)),0)","v":0},{"$f":"IFERROR(INDEX(secundarias,MATCH(EH7,ranking_premios,0)),0)","v":0},{"$f":"IFERROR(INDEX(secundarias,MATCH(EI7,ranking_premios,0)),0)","v":0},{"$f":"IFERROR(INDEX(secundarias,MATCH(EJ7,ranking_premios,0)),0)","v":0},{"$f":"IFERROR(INDEX(secundarias,MATCH(EK7,ranking_premios,0)),0)","v":0},{"$f":"IFERROR(INDEX(secundarias,MATCH(EL7,ranking_premios,0)),0)","v":0},{"$f":"IFERROR(INDEX(secundarias,MATCH(EM7,ranking_premios,0)),0)","v":0},{"$f":"IFERROR(INDEX(secundarias,MATCH(EN7,ranking_premios,0)),0)","v":0},{"$f":"IFERROR(INDEX(secundarias,MATCH(EO7,ranking_premios,0)),0)","v":0},{"$f":"IFERROR(INDEX(secundarias,MATCH(EP7,ranking_premios,0)),0)","v":0},{"$f":"IFERROR(INDEX(secundarias,MATCH(EQ7,ranking_premios,0)),0)","v":0},{"$f":"IFERROR(INDEX(secundarias,MATCH(ER7,ranking_premios,0)),0)","v":0},{"$f":"IFERROR(INDEX(secundarias,MATCH(ES7,ranking_premios,0)),0)","v":0},{"$f":"IFERROR(INDEX(secundarias,MATCH(ET7,ranking_premios,0)),0)","v":0},{"$f":"IFERROR(INDEX(secundarias,MATCH(EU7,ranking_premios,0)),0)","v":0},{"$f":"IFERROR(INDEX(secundarias,MATCH(EV7,ranking_premios,0)),0)","v":0},{"$f":"IFERROR(INDEX(secundarias,MATCH(EW7,ranking_premios,0)),0)","v":0},{"$f":"IFERROR(INDEX(secundarias,MATCH(EX7,ranking_premios,0)),0)","v":0},{"$f":"IFERROR(INDEX(secundarias,MATCH(EY7,ranking_premios,0)),0)","v":0},{"$f":"IFERROR(INDEX(secundarias,MATCH(EZ7,ranking_premios,0)),0)","v":0},{"$f":"IFERROR(INDEX(secundarias,MATCH(FA7,ranking_premios,0)),0)","v":0},{"$f":"IFERROR(INDEX(secundarias,MATCH(FB7,ranking_premios,0)),0)","v":0},{"$f":"IFERROR(INDEX(secundarias,MATCH(FC7,ranking_premios,0)),0)","v":0},{"$f":"IFERROR(INDEX(secundarias,MATCH(FD7,ranking_premios,0)),0)","v":0},{"$f":"IFERROR(INDEX(secundarias,MATCH(FE7,ranking_premios,0)),0)","v":0},{"$f":"IFERROR(INDEX(secundarias,MATCH(FF7,ranking_premios,0)),0)","v":0},{"$f":"IFERROR(INDEX(secundarias,MATCH(FG7,ranking_premios,0)),0)","v":0},{"$f":"IFERROR(INDEX(secundarias,MATCH(FH7,ranking_premios,0)),0)","v":0},{"$f":"IFERROR(INDEX(secundarias,MATCH(FI7,ranking_premios,0)),0)","v":0},{"$f":"IFERROR(INDEX(secundarias,MATCH(FJ7,ranking_premios,0)),0)","v":0},{"$f":"IFERROR(INDEX(secundarias,MATCH(FK7,ranking_premios,0)),0)","v":0},{"$f":"IFERROR(INDEX(secundarias,MATCH(FL7,ranking_premios,0)),0)","v":0},null,{"$f":"IF(C7<>\"\",CONCATENATE(DK$5,\" \",C7,\"\"))","v":false},{"$f":"IF(D7<>\"\",CONCATENATE(DL$5,\" \",D7,\"\"))","v":false},false,false,false,false,false,false,false,false,false,false,false,false,false,false,false,false,false,false,false,false,false,false,false,false,false,false,false,false,false,false,false,false,false,false,false,false,false,false,false,false,false,false,false,false,false,false,false,false,false,false,false,false,{"$f":"SUM(BH7:CH7)","v":0}]
[null,{"$f":"IF(Plantilla!D4<>0,Plantilla!D4,\"\")","v":"Samuel Sánchez"},null,null,null,null,null,null,null,null,null,null,null,null,null,null,null,null,null,null,null,null,null,null,null,null,null,null,null,null,null,null,null,null,null,null,null,null,null,null,null,null,null,null,null,null,null,null,null,null,null,null,null,null,null,null,null,{"$f":"INDIRECT(ADDRESS(ROW(),MATCH($BF$2,carreras,0)+1))","v":0},"",0,0,0,0,0,0,0,0,0,0,{"$f":"IFERROR(INDEX(secundarias,MATCH(DU8,ranking_premios,0)),0)","v":0},0,0,0,0,0,0,0,0,0,0,0,0,0,0,0,0,0,0,0,0,0,0,0,0,0,0,0,0,0,0,0,0,0,0,0,0,0,0,0,0,0,0,0,null,{"$f":"IF(C8<>\"\",CONCATENATE(DK$5,\" \",C8,\"\"))","v":false},{"$f":"IF(D8<>\"\",CONCATENATE(DL$5,\" \",D8,\"\"))","v":false},{"$f":"IF(E8<>\"\",CONCATENATE(DM$5,\" \",E8,\"\"))","v":false},{"$f":"IF(F8<>\"\",CONCATENATE(DN$5,\" \",F8,\"\"))","v":false},{"$f":"IF(G8<>\"\",CONCATENATE(DO$5,\" \",G8,\"\"))","v":false},{"$f":"IF(H8<>\"\",CONCATENATE(DP$5,\" \",H8,\"\"))","v":false},{"$f":"IF(I8<>\"\",CONCATENATE(DQ$5,\" \",I8,\"\"))","v":false},{"$f":"IF(J8<>\"\",CONCATENATE(DR$5,\" \",J8,\"\"))","v":false},{"$f":"IF(K8<>\"\",CONCATENATE(DS$5,\" \",K8,\"\"))","v":false},{"$f":"IF(L8<>\"\",CONCATENATE(DT$5,\" \",L8,\"\"))","v":false},{"$f":"IF(M8<>\"\",CONCATENATE(DU$5,\" \",M8,\"\"))","v":false},{"$f":"IF(N8<>\"\",CONCATENATE(DV$5,\" \",N8,\"\"))","v":false},{"$f":"IF(O8<>\"\",CONCATENATE(DW$5,\" \",O8,\"\"))","v":false},{"$f":"IF(P8<>\"\",CONCATENATE(DX$5,\" \",P8,\"\"))","v":false},{"$f":"IF(Q8<>\"\",CONCATENATE(DY$5,\" \",Q8,\"\"))","v":false},{"$f":"IF(R8<>\"\",CONCATENATE(DZ$5,\" \",R8,\"\"))","v":false},{"$f":"IF(S8<>\"\",CONCATENATE(EA$5,\" \",S8,\"\"))","v":false},{"$f":"IF(T8<>\"\",CONCATENATE(EB$5,\" \",T8,\"\"))","v":false},{"$f":"IF(U8<>\"\",CONCATENATE(EC$5,\" \",U8,\"\"))","v":false},{"$f":"IF(V8<>\"\",CONCATENATE(ED$5,\" \",V8,\"\"))","v":false},{"$f":"IF(W8<>\"\",CONCATENATE(EE$5,\" \",W8,\"\"))","v":false},{"$f":"IF(X8<>\"\",CONCATENATE(EF$5,\" \",X8,\"\"))","v":false},{"$f":"IF(Y8<>\"\",CONCATENATE(EG$5,\" \",Y8,\"\"))","v":false},{"$f":"IF(Z8<>\"\",CONCATENATE(EH$5,\" \",Z8,\"\"))","v":false},{"$f":"IF(AA8<>\"\",CONCATENATE(EI$5,\" \",AA8,\"\"))","v":false},{"$f":"IF(AB8<>\"\",CONCATENATE(EJ$5,\" \",AB8,\"\"))","v":false},{"$f":"IF(AC8<>\"\",CONCATENATE(EK$5,\" \",AC8,\"\"))","v":false},{"$f":"IF(AD8<>\"\",CONCATENATE(EL$5,\" \",AD8,\"\"))","v":false},{"$f":"IF(AE8<>\"\",CONCATENATE(EM$5,\" \",AE8,\"\"))","v":false},{"$f":"IF(AF8<>\"\",CONCATENATE(EN$5,\" \",AF8,\"\"))","v":false},{"$f":"IF(AG8<>\"\",CONCATENATE(EO$5,\" \",AG8,\"\"))","v":false},{"$f":"IF(AH8<>\"\",CONCATENATE(EP$5,\" \",AH8,\"\"))","v":false},{"$f":"IF(AI8<>\"\",CONCATENATE(EQ$5,\" \",AI8,\"\"))","v":false},{"$f":"IF(AJ8<>\"\",CONCATENATE(ER$5,\" \",AJ8,\"\"))","v":false},{"$f":"IF(AK8<>\"\",CONCATENATE(ES$5,\" \",AK8,\"\"))","v":false},{"$f":"IF(AL8<>\"\",CONCATENATE(ET$5,\" \",AL8,\"\"))","v":false},{"$f":"IF(AM8<>\"\",CONCATENATE(EU$5,\" \",AM8,\"\"))","v":false},{"$f":"IF(AN8<>\"\",CONCATENATE(EV$5,\" \",AN8,\"\"))","v":false},{"$f":"IF(AO8<>\"\",CONCATENATE(EW$5,\" \",AO8,\"\"))","v":false},{"$f":"IF(AP8<>\"\",CONCATENATE(EX$5,\" \",AP8,\"\"))","v":false},{"$f":"IF(AQ8<>\"\",CONCATENATE(EY$5,\" \",AQ8,\"\"))","v":false},{"$f":"IF(AR8<>\"\",CONCATENATE(EZ$5,\" \",AR8,\"\"))","v":false},{"$f":"IF(AS8<>\"\",CONCATENATE(FA$5,\" \",AS8,\"\"))","v":false},{"$f":"IF(AT8<>\"\",CONCATENATE(FB$5,\" \",AT8,\"\"))","v":false},{"$f":"IF(AU8<>\"\",CONCATENATE(FC$5,\" \",AU8,\"\"))","v":false},{"$f":"IF(AV8<>\"\",CONCATENATE(FD$5,\" \",AV8,\"\"))","v":false},{"$f":"IF(AW8<>\"\",CONCATENATE(FE$5,\" \",AW8,\"\"))","v":false},{"$f":"IF(AX8<>\"\",CONCATENATE(FF$5,\" \",AX8,\"\"))","v":false},{"$f":"IF(AY8<>\"\",CONCATENATE(FG$5,\" \",AY8,\"\"))","v":false},{"$f":"IF(AZ8<>\"\",CONCATENATE(FH$5,\" \",AZ8,\"\"))","v":false},{"$f":"IF(BA8<>\"\",CONCATENATE(FI$5,\" \",BA8,\"\"))","v":false},{"$f":"IF(BB8<>\"\",CONCATENATE(FJ$5,\" \",BB8,\"\"))","v":false},{"$f":"IF(BC8<>\"\",CONCATENATE(FK$5,\" \",BC8,\"\"))","v":false},{"$f":"IF(BD8<>\"\",CONCATENATE(FL$5,\" \",BD8,\"\"))","v":false},{"$f":"SUM(BH8:CH8)","v":0}]
[null,{"$f":"IF(Plantilla!D5<>0,Plantilla!D5,\"\")","v":"Jean-Cr. Péraud"},null,null,null,null,null,null,null,null,null,null,null,null,null,null,null,null,null,null,null,null,null,null,null,null,null,null,null,null,null,null,null,null,null,null,null,null,null,null,null,null,null,null,null,null,null,null,null,null,null,null,null,null,null,null,null,0,{"$f":"IF(BF9=1,B9,\"\")","v":""},{"$f":"IFERROR(INDEX(secundarias,MATCH(DK9,ranking_premios,0)),0)","v":0},{"$f":"IFERROR(INDEX(secundarias,MATCH(DL9,ranking_premios,0)),0)","v":0},{"$f":"IFERROR(INDEX(secundarias,MATCH(DM9,ranking_premios,0)),0)","v":0},{"$f":"IFERROR(INDEX(secundarias,MATCH(DN9,ranking_premios,0)),0)","v":0},{"$f":"IFERROR(INDEX(secundarias,MATCH(DO9,ranking_premios,0)),0)","v":0},{"$f":"IFERROR(INDEX(secundarias,MATCH(DP9,ranking_premios,0)),0)","v":0},{"$f":"IFERROR(INDEX(secundarias,MATCH(DQ9,ranking_premios,0)),0)","v":0},{"$f":"IFERROR(INDEX(secundarias,MATCH(DR9,ranking_premios,0)),0)","v":0},{"$f":"IFERROR(INDEX(secundarias,MATCH(DS9,ranking_premios,0)),0)","v":0},{"$f":"IFERROR(INDEX(secundarias,MATCH(DT9,ranking_premios,0)),0)","v":0},{"$f":"IFERROR(INDEX(secundarias,MATCH(DU9,ranking_premios,0)),0)","v":0},{"$f":"IFERROR(INDEX(secundarias,MATCH(DV9,ranking_premios,0)),0)","v":0},{"$f":"IFERROR(INDEX(secundarias,MATCH(DW9,ranking_premios,0)),0)","v":0},{"$f":"IFERROR(INDEX(secundarias,MATCH(DX9,ranking_premios,0)),0)","v":0},{"$f":"IFERROR(INDEX(secundarias,MATCH(DY9,ranking_premios,0)),0)","v":0},{"$f":"IFERROR(INDEX(secundarias,MATCH(DZ9,ranking_premios,0)),0)","v":0},{"$f":"IFERROR(INDEX(secundarias,MATCH(EA9,ranking_premios,0)),0)","v":0},{"$f":"IFERROR(INDEX(secundarias,MATCH(EB9,ranking_premios,0)),0)","v":0},{"$f":"IFERROR(INDEX(secundarias,MATCH(EC9,ranking_premios,0)),0)","v":0},{"$f":"IFERROR(INDEX(secundarias,MATCH(ED9,ranking_premios,0)),0)","v":0},{"$f":"IFERROR(INDEX(secundarias,MATCH(EE9,ranking_premios,0)),0)","v":0},{"$f":"IFERROR(INDEX(secundarias,MATCH(EF9,ranking_premios,0)),0)","v":0},{"$f":"IFERROR(INDEX(secundarias,MATCH(EG9,ranking_premios,0)),0)","v":0},{"$f":"IFERROR(INDEX(secundarias,MATCH(EH9,ranking_premios,0)),0)","v":0},{"$f":"IFERROR(INDEX(secundarias,MATCH(EI9,ranking_premios,0)),0)","v":0},{"$f":"IFERROR(INDEX(secundarias,MATCH(EJ9,ranking_premios,0)),0)","v":0},{"$f":"IFERROR(INDEX(secundarias,MATCH(EK9,ranking_premios,0)),0)","v":0},{"$f":"IFERROR(INDEX(secundarias,MATCH(EL9,ranking_premios,0)),0)","v":0},{"$f":"IFERROR(INDEX(secundarias,MATCH(EM9,ranking_premios,0)),0)","v":0},{"$f":"IFERROR(INDEX(secundarias,MATCH(EN9,ranking_premios,0)),0)","v":0},{"$f":"IFERROR(INDEX(secundarias,MATCH(EO9,ranking_premios,0)),0)","v":0},{"$f":"IFERROR(INDEX(secundarias,MATCH(EP9,ranking_premios,0)),0)","v":0},{"$f":"IFERROR(INDEX(secundarias,MATCH(EQ9,ranking_premios,0)),0)","v":0},{"$f":"IFERROR(INDEX(secundarias,MATCH(ER9,ranking_premios,0)),0)","v":0},{"$f":"IFERROR(INDEX(secundarias,MATCH(ES9,ranking_premios,0)),0)","v":0},{"$f":"IFERROR(INDEX(secundarias,MATCH(ET9,ranking_premios,0)),0)","v":0},{"$f":"IFERROR(INDEX(secundarias,MATCH(EU9,ranking_premios,0)),0)","v":0},{"$f":"IFERROR(INDEX(secundarias,MATCH(EV9,ranking_premios,0)),0)","v":0},{"$f":"IFERROR(INDEX(secundarias,MATCH(EW9,ranking_premios,0)),0)","v":0},{"$f":"IFERROR(INDEX(secundarias,MATCH(EX9,ranking_premios,0)),0)","v":0},{"$f":"IFERROR(INDEX(secundarias,MATCH(EY9,ranking_premios,0)),0)","v":0},{"$f":"IFERROR(INDEX(secundarias,MATCH(EZ9,ranking_premios,0)),0)","v":0},{"$f":"IFERROR(INDEX(secundarias,MATCH(FA9,ranking_premios,0)),0)","v":0},{"$f":"IFERROR(INDEX(secundarias,MATCH(FB9,ranking_premios,0)),0)","v":0},{"$f":"IFERROR(INDEX(secundarias,MATCH(FC9,ranking_premios,0)),0)","v":0},{"$f":"IFERROR(INDEX(secundarias,MATCH(FD9,ranking_premios,0)),0)","v":0},{"$f":"IFERROR(INDEX(secundarias,MATCH(FE9,ranking_premios,0)),0)","v":0},{"$f":"IFERROR(INDEX(secundarias,MATCH(FF9,ranking_premios,0)),0)","v":0},{"$f":"IFERROR(INDEX(secundarias,MATCH(FG9,ranking_premios,0)),0)","v":0},{"$f":"IFERROR(INDEX(secundarias,MATCH(FH9,ranking_premios,0)),0)","v":0},{"$f":"IFERROR(INDEX(secundarias,MATCH(FI9,ranking_premios,0)),0)","v":0},{"$f":"IFERROR(INDEX(secundarias,MATCH(FJ9,ranking_premios,0)),0)","v":0},{"$f":"IFERROR(INDEX(secundarias,MATCH(FK9,ranking_premios,0)),0)","v":0},{"$f":"IFERROR(INDEX(secundarias,MATCH(FL9,ranking_premios,0)),0)","v":0},null,false,false,false,false,false,false,false,false,false,false,false,false,false,false,false,false,false,false,false,false,false,false,false,false,false,false,false,false,false,false,false,false,false,false,false,false,false,false,false,false,false,false,false,false,false,false,false,false,false,false,false,false,false,false,0]
[null,{"$f":"IF(Plantilla!D6<>0,Plantilla!D6,\"\")","v":"Daniel Martin"},null,null,null,null,null,null,null,null,null,null,null,null,null,null,null,null,null,null,null,null,null,null,null,null,null,null,null,null,null,null,null,null,null,null,null,null,null,null,null,null,null,null,null,null,null,null,null,null,null,null,null,null,null,null,null,0,"",0,0,0,0,0,0,0,0,0,0,0,0,0,0,0,0,0,0,0,0,0,0,0,0,0,0,0,0,0,0,0,0,0,0,0,0,0,0,0,0,0,0,0,0,0,0,0,0,0,0,0,0,0,0,null,false,false,false,false,false,false,false,false,false,false,false,false,false,false,false,false,false,false,false,false,false,false,false,false,false,false,false,false,false,false,false,false,false,false,false,false,false,false,false,false,false,false,false,false,false,false,false,false,false,false,false,false,false,false,0]
[null,{"$f":"IF(Plantilla!D7<>0,Plantilla!D7,\"\")","v":"José Joaquin Rojas"},null,null,null,null,null,null,null,null,null,null,null,null,null,null,null,null,null,null,null,null,null,null,null,null,null,null,null,null,null,null,null,null,null,null,null,null,null,null,null,null,null,null,null,null,null,null,null,null,null,null,null,null,null,null,null,0,"",0,0,0,0,0,0,0,0,0,0,0,0,0,0,0,0,0,0,0,0,0,0,0,0,0,0,0,0,0,0,0,0,0,0,0,0,0,0,0,0,0,0,0,0,0,0,0,0,0,0,0,0,0,0,null,false,false,false,false,false,false,false,false,false,false,false,false,false,false,false,false,false,false,false,false,false,false,false,false,false,false,false,false,false,false,false,false,false,false,false,false,false,false,false,false,false,false,false,false,false,false,false,false,false,false,false,false,false,false,0]
[null,{"$f":"IF(Plantilla!D8<>0,Plantilla!D8,\"\")","v":"Fran Ventoso"},null,null,null,null,null,null,null,null,null,null,null,null,null,null,null,null,null,null,null,null,null,null,null,null,null,null,null,null,null,null,null,null,null,null,null,null,null,null,null,null,null,null,null,null,null,null,null,null,null,null,null,null,null,null,null,0,"",0,0,0,0,0,0,0,0,0,0,0,0,0,0,0,0,0,0,0,0,0,0,0,0,0,0,0,0,0,0,0,0,0,0,0,0,0,0,0,0,0,0,0,0,0,0,0,0,0,0,0,0,0,0,null,false,false,false,false,false,false,false,false,false,false,false,false,false,false,false,false,false,false,false,false,false,false,false,false,false,false,false,false,false,false,false,false,false,false,false,false,false,false,false,false,false,false,false,false,false,false,false,false,false,false,false,false,false,false,0]
[null,{"$f":"IF(Plantilla!D9<>0,Plantilla!D9,\"\")","v":"Rui Costa"},null,null,null,null,null,null,null,null,null,null,null,null,null,null,null,null,null,null,null,null,null,null,null,null,null,null,null,null,null,null,null,null,null,null,null,null,null,null,null,null,null,null,null,null,null,null,null,null,null,null,null,null,null,null,null,0,"",0,0,0,0,0,0,0,0,0,0,0,0,0,0,0,0,0,0,0,0,0,0,0,0,0,0,0,0,0,0,0,0,0,0,0,0,0,0,0,0,0,0,0,0,0,0,0,0,0,0,0,0,0,0,null,false,false,false,false,false,false,false,false,false,false,false,false,false,false,false,false,false,false,false,false,false,false,false,false,false,false,false,false,false,false,false,false,false,false,false,false,false,false,false,false,false,false,false,false,false,false,false,false,false,false,false,false,false,false,0]
[null,{"$f":"IF(Plantilla!D10<>0,Plantilla!D10,\"\")","v":"Christopher Sutton"},null,null,null,null,null,null,null,null,null,null,null,null,null,null,null,null,null,null,null,null,null,null,null,null,null,null,null,null,null,null,null,null,null,null,null,null,null,null,null,null,null,null,null,null,null,null,null,null,null,null,null,null,null,null,null,0,"",0,0,0,0,0,0,0,0,0,0,0,0,0,0,0,0,0,0,0,0,0,0,0,0,0,0,0,0,0,0,0,0,0,0,0,0,0,0,0,0,0,0,0,0,0,0,0,0,0,0,0,0,0,0,null,false,false,false,false,false,false,false,false,false,false,false,false,false,false,false,false,false,false,false,false,false,false,false,false,false,false,false,false,false,false,false,false,false,false,false,false,false,false,false,false,false,false,false,false,false,false,false,false,false,false,false,false,false,false,0]
[null,{"$f":"IF(Plantilla!D11<>0,Plantilla!D11,\"\")","v":"Vladimir Karpets"},null,null,null,null,null,null,null,null,null,null,null,null,null,null,null,null,null,null,null,null,null,null,null,null,null,null,null,null,null,null,null,null,null,null,null,null,null,null,null,null,null,null,null,null,null,null,null,null,null,null,null,null,null,null,null,0,"",0,0,0,0,0,0,0,0,0,0,0,0,0,0,0,0,0,0,0,0,0,0,0,0,0,0,0,0,0,0,0,0,0,0,0,0,0,0,0,0,0,0,0,0,0,0,0,0,0,0,0,0,0,0,null,false,false,false,false,false,false,false,false,false,false,false,false,false,false,false,false,false,false,false,false,false,false,false,false,false,false,false,false,false,false,false,false,false,false,false,false,false,false,false,false,false,false,false,false,false,false,false,false,false,false,false,false,false,false,0]
[null,{"$f":"IF(Plantilla!D12<>0,Plantilla!D12,\"\")","v":"Julian Dean"},null,null,null,null,null,null,null,null,null,null,null,null,null,null,null,null,null,null,null,null,null,null,null,null,null,null,null,null,null,null,null,null,null,null,null,null,null,null,null,null,null,null,null,null,null,null,null,null,null,null,null,null,null,null,null,0,"",0,0,0,0,0,0,0,0,0,0,0,0,0,0,0,0,0,0,0,0,0,0,0,0,0,0,0,0,0,0,0,0,0,0,0,0,0,0,0,0,0,0,0,0,0,0,0,0,0,0,0,0,0,0,null,false,false,false,false,false,false,false,false,false,false,false,false,false,false,false,false,false,false,false,false,false,false,false,false,false,false,false,false,false,false,false,false,false,false,false,false,false,false,false,false,false,false,false,false,false,false,false,false,false,false,false,false,false,false,0]
[null,{"$f":"IF(Plantilla!D13<>0,Plantilla!D13,\"\")","v":"Andreas Klier"},null,null,null,null,null,null,null,null,null,null,null,null,null,null,null,null,null,null,null,null,null,null,null,null,null,null,null,null,null,null,null,null,null,null,null,null,null,null,null,null,null,null,null,null,null,null,null,null,null,null,null,null,null,null,null,0,"",0,0,0,0,0,0,0,0,0,0,0,0,0,0,0,0,0,0,0,0,0,0,0,0,0,0,0,0,0,0,0,0,0,0,0,0,0,0,0,0,0,0,0,0,0,0,0,0,0,0,0,0,0,0,null,false,false,false,false,false,false,false,false,false,false,false,false,false,false,false,false,false,false,false,false,false,false,false,false,false,false,false,false,false,false,false,false,false,false,false,false,false,false,false,false,false,false,false,false,false,false,false,false,false,false,false,false,false,false,0]
[null,{"$f":"IF(Plantilla!D14<>0,Plantilla!D14,\"\")","v":"Elia Viviani"},null,null,null,null,null,null,null,null,null,null,null,null,null,null,null,null,null,null,null,null,null,null,null,null,null,null,null,null,null,null,null,null,null,null,null,null,null,null,null,null,null,null,null,null,null,null,null,null,null,null,null,null,null,null,null,0,"",0,0,0,0,0,0,0,0,0,0,0,0,0,0,0,0,0,0,0,0,0,0,0,0,0,0,0,0,0,0,0,0,0,0,0,0,0,0,0,0,0,0,0,0,0,0,0,0,0,0,0,0,0,0,null,false,false,false,false,false,false,false,false,false,false,false,false,false,false,false,false,false,false,false,false,false,false,false,false,false,false,false,false,false,false,false,false,false,false,false,false,false,false,false,false,false,false,false,false,false,false,false,false,false,false,false,false,false,false,0]
[null,{"$f":"IF(Plantilla!D15<>0,Plantilla!D15,\"\")","v":"Daniel Navarro"},null,null,null,null,null,null,null,null,null,null,null,null,null,null,null,null,null,null,null,null,null,null,null,null,null,null,null,null,null,null,null,null,null,null,null,null,null,null,null,null,null,null,null,null,null,null,null,null,null,null,null,null,null,null,null,0,"",0,0,0,0,0,0,0,0,0,0,0,0,0,0,0,0,0,0,0,0,0,0,0,0,0,0,0,0,0,0,0,0,0,0,0,0,0,0,0,0,0,0,0,0,0,0,0,0,0,0,0,0,0,0,null,false,false,false,false,false,false,false,false,false,false,false,false,false,false,false,false,false,false,false,false,false,false,false,false,false,false,false,false,false,false,false,false,false,false,false,false,false,false,false,false,false,false,false,false,false,false,false,false,false,false,false,false,false,false,0]
[null,{"$f":"IF(Plantilla!D20<>0,Plantilla!D20,\"\")","v":"Jure Kocjan"},null,null,null,null,null,null,null,null,null,null,null,null,null,null,null,null,null,null,null,null,null,null,null,null,null,null,null,null,null,null,null,null,null,null,null,null,null,null,null,null,null,null,null,null,null,null,null,null,null,null,null,null,null,null,null,0,"",0,0,0,0,0,0,0,0,0,0,0,0,0,0,0,0,0,0,0,0,0,0,0,0,0,0,0,0,0,0,0,0,0,0,0,0,0,0,0,0,0,0,0,0,0,0,0,0,0,0,0,0,0,0,null,false,false,false,false,false,false,false,false,false,false,false,false,false,false,false,false,false,false,false,false,false,false,false,false,false,false,false,false,false,false,false,false,false,false,false,false,false,false,false,false,false,false,false,false,false,false,false,false,false,false,false,false,false,false,0]
[null,{"$f":"IF(Plantilla!D21<>0,Plantilla!D21,\"\")","v":"Przemyslaw Niemiec"},null,null,null,null,null,null,null,null,null,null,null,null,null,null,null,null,null,null,null,null,null,null,null,null,null,null,null,null,null,null,null,null,null,null,null,null,null,null,null,null,null,null,null,null,null,null,null,null,null,null,null,null,null,null,null,0,"",0,0,0,0,0,0,0,0,0,0,0,0,0,0,0,0,0,0,0,0,0,0,0,0,0,0,0,0,0,0,0,0,0,0,0,0,0,0,0,0,0,0,0,0,0,0,0,0,0,0,0,0,0,0,null,false,false,false,false,false,false,false,false,false,false,false,false,false,false,false,false,false,false,false,false,false,false,false,false,false,false,false,false,false,false,false,false,false,false,false,false,false,false,false,false,false,false,false,false,false,false,false,false,false,false,false,false,false,false,0]
[null,{"$f":"IF(Plantilla!D22<>0,Plantilla!D22,\"\")","v":"Sergio Paulinho"},null,null,null,null,null,null,null,null,null,null,null,null,null,null,null,null,null,null,null,null,null,null,null,null,null,null,null,null,null,null,null,null,null,null,null,null,null,null,null,null,null,null,null,null,null,null,null,null,null,null,null,null,null,null,null,0,"",0,0,0,0,0,0,0,0,0,0,0,0,0,0,0,0,0,0,0,0,0,0,0,0,0,0,0,0,0,0,0,0,0,0,0,0,0,0,0,0,0,0,0,0,0,0,0,0,0,0,0,0,0,0,null,false,false,false,false,false,false,false,false,false,false,false,false,false,false,false,false,false,false,false,false,false,false,false,false,false,false,false,false,false,false,false,false,false,false,false,false,false,false,false,false,false,false,false,false,false,false,false,false,false,false,false,false,false,false,0]
[null,{"$f":"IF(Plantilla!D19<>0,Plantilla!D19,\"\")","v":"Fabio Sabatini"},null,null,null,null,null,null,null,null,null,null,null,null,null,null,null,null,null,null,null,null,null,null,null,null,null,null,null,null,null,null,null,null,null,null,null,null,null,null,null,null,null,null,null,null,null,null,null,null,null,null,null,null,null,null,null,0,"",0,0,0,0,0,0,0,0,0,0,0,0,0,0,0,0,0,0,0,0,0,0,0,0,0,0,0,0,0,0,0,0,0,0,0,0,0,0,0,0,0,0,0,0,0,0,0,0,0,0,0,0,0,0,null,false,false,false,false,false,false,false,false,false,false,false,false,false,false,false,false,false,false,false,false,false,false,false,false,false,false,false,false,false,false,false,false,false,false,false,false,false,false,false,false,false,false,false,false,false,false,false,false,false,false,false,false,false,false,0]
[null,{"$f":"IF(Plantilla!D16<>0,Plantilla!D16,\"\")","v":"Johann Tschopp"},null,null,null,null,null,null,null,null,null,null,null,null,null,null,null,null,null,null,null,null,null,null,null,null,null,null,null,null,null,null,null,null,null,null,null,null,null,null,null,null,null,null,null,null,null,null,null,null,null,null,null,null,null,null,null,0,"",0,0,0,0,0,0,0,0,0,0,0,0,0,0,0,0,0,0,0,0,0,0,0,0,0,0,0,0,0,0,0,0,0,0,0,0,0,0,0,0,0,0,0,0,0,0,0,0,0,0,0,0,0,0,null,false,false,false,false,false,false,false,false,false,false,false,false,false,false,false,false,false,false,false,false,false,false,false,false,false,false,false,false,false,false,false,false,false,false,false,false,false,false,false,false,false,false,false,false,false,false,false,false,false,false,false,false,false,false,0]
[null,{"$f":"IF(Plantilla!D17<>0,Plantilla!D17,\"\")","v":"Miguel A. Ubeto"},null,null,null,null,null,null,null,null,null,null,null,null,null,null,null,null,null,null,null,null,null,null,null,null,null,null,null,null,null,null,null,null,null,null,null,null,null,null,null,null,null,null,null,null,null,null,null,null,null,null,null,null,null,null,null,0,"",0,0,0,0,0,0,0,0,0,0,0,0,0,0,0,0,0,0,0,0,0,0,0,0,0,0,0,0,0,0,0,0,0,0,0,0,0,0,0,0,0,0,0,0,0,0,0,0,0,0,0,0,0,0,null,false,false,false,false,false,false,false,false,false,false,false,false,false,false,false,false,false,false,false,false,false,false,false,false,false,false,false,false,false,false,false,false,false,false,false,false,false,false,false,false,false,false,false,false,false,false,false,false,false,false,false,false,false,false,0]
[null,{"$f":"IF(Plantilla!D18<>0,Plantilla!D18,\"\")","v":"Tom-Jelte Slagter"},null,null,null,null,null,null,null,null,null,null,null,null,null,null,null,null,null,null,null,null,null,null,null,null,null,null,null,null,null,null,null,null,null,null,null,null,null,null,null,null,null,null,null,null,null,null,null,null,null,null,null,null,null,null,null,0,"",0,0,0,0,0,0,0,0,0,0,0,0,0,0,0,0,0,0,0,0,0,0,0,0,0,0,0,0,0,0,0,0,0,0,0,0,0,0,0,0,0,0,0,0,0,0,0,0,0,0,0,0,0,0,null,false,false,false,false,false,false,false,false,false,false,false,false,false,false,false,false,false,false,false,false,false,false,false,false,false,false,false,false,false,false,false,false,false,false,false,false,false,false,false,false,false,false,false,false,false,false,false,false,false,false,false,false,false,false,0]
[null,{"$f":"IF(Plantilla!D23<>0,Plantilla!D23,\"\")","v":""},null,null,null,null,null,null,null,null,null,null,null,null,null,null,null,null,null,null,null,null,null,null,null,null,null,null,null,null,null,null,null,null,null,null,null,null,null,null,null,null,null,null,null,null,null,null,null,null,null,null,null,null,null,null,null,0,"",0,0,0,0,0,0,0,0,0,0,0,0,0,0,0,0,0,0,0,0,0,0,0,0,0,0,0,0,0,0,0,0,0,0,0,0,0,0,0,0,0,0,0,0,0,0,0,0,0,0,0,0,0,0,null,false,false,false,false,false,false,false,false,false,false,false,false,false,false,false,false,false,false,false,false,false,false,false,false,false,false,false,false,false,false,false,false,false,false,false,false,false,false,false,false,false,false,false,false,false,false,false,false,false,false,false,false,false,false,0]
[null,{"$f":"IF(Plantilla!D24<>0,Plantilla!D24,\"\")","v":""},null,null,null,null,null,null,null,null,null,null,null,null,null,null,null,null,null,null,null,null,null,null,null,null,null,null,null,null,null,null,null,null,null,null,null,null,null,null,null,null,null,null,null,null,null,null,null,null,null,null,null,null,null,null,null,0,"",0,0,0,0,0,0,0,0,0,0,0,0,0,0,0,0,0,0,0,0,0,0,0,0,0,0,0,0,0,0,0,0,0,0,0,0,0,0,0,0,0,0,0,0,0,0,0,0,0,0,0,0,0,0,null,false,false,false,false,false,false,false,false,false,false,false,false,false,false,false,false,false,false,false,false,false,false,false,false,false,false,false,false,false,false,false,false,false,false,false,false,false,false,false,false,false,false,false,false,false,false,false,false,false,false,false,false,false,false,0]
[null,{"$f":"IF(Plantilla!D25<>0,Plantilla!D25,\"\")","v":""},null,null,null,null,null,null,null,null,null,null,null,null,null,null,null,null,null,null,null,null,null,null,null,null,null,null,null,null,null,null,null,null,null,null,null,null,null,null,null,null,null,null,null,null,null,null,null,null,null,null,null,null,null,null,null,0,"",0,0,0,0,0,0,0,0,0,0,0,0,0,0,0,0,0,0,0,0,0,0,0,0,0,0,0,0,0,0,0,0,0,0,0,0,0,0,0,0,0,0,0,0,0,0,0,0,0,0,0,0,0,0,null,false,false,false,false,false,false,false,false,false,false,false,false,false,false,false,false,false,false,false,false,false,false,false,false,false,false,false,false,false,false,false,false,false,false,false,false,false,false,false,false,false,false,false,false,false,false,false,false,false,false,false,false,false,false,0]
[null,{"$f":"IF(Plantilla!D26<>0,Plantilla!D26,\"\")","v":""},null,null,null,null,null,null,null,null,null,null,null,null,null,null,null,null,null,null,null,null,null,null,null,null,null,null,null,null,null,null,null,null,null,null,null,null,null,null,null,null,null,null,null,null,null,null,null,null,null,null,null,null,null,null,null,0,"",0,0,0,0,0,0,0,0,0,0,0,0,0,0,0,0,0,0,0,0,0,0,0,0,0,0,0,0,0,0,0,0,0,0,0,0,0,0,0,0,0,0,0,0,0,0,0,0,0,0,0,0,0,0,null,false,false,false,false,false,false,false,false,false,false,false,false,false,false,false,false,false,false,false,false,false,false,false,false,false,false,false,false,false,false,false,false,false,false,false,false,false,false,false,false,false,false,false,false,false,false,false,false,false,false,false,false,false,false,0]
[null,{"$f":"IF(Plantilla!D27<>0,Plantilla!D27,\"\")","v":""},null,null,null,null,null,null,null,null,null,null,null,null,null,null,null,null,null,null,null,null,null,null,null,null,null,null,null,null,null,null,null,null,null,null,null,null,null,null,null,null,null,null,null,null,null,null,null,null,null,null,null,null,null,null,null,0,"",0,0,0,0,0,0,0,0,0,0,0,0,0,0,0,0,0,0,0,0,0,0,0,0,0,0,0,0,0,0,0,0,0,0,0,0,0,0,0,0,0,0,0,0,0,0,0,0,0,0,0,0,0,0,null,false,false,false,false,false,false,false,false,false,false,false,false,false,false,false,false,false,false,false,false,false,false,false,false,false,false,false,false,false,false,false,false,false,false,false,false,false,false,false,false,false,false,false,false,false,false,false,false,false,false,false,false,false,false,0]
[null,{"$f":"IF(Plantilla!D28<>0,Plantilla!D28,\"\")","v":""},null,null,null,null,null,null,null,null,null,null,null,null,null,null,null,null,null,null,null,null,null,null,null,null,null,null,null,null,null,null,null,null,null,null,null,null,null,null,null,null,null,null,null,null,null,null,null,null,null,null,null,null,null,null,null,0,"",0,0,0,0,0,0,0,0,0,0,0,0,0,0,0,0,0,0,0,0,0,0,0,0,0,0,0,0,0,0,0,0,0,0,0,0,0,0,0,0,0,0,0,0,0,0,0,0,0,0,0,0,0,0,null,false,false,false,false,false,false,false,false,false,false,false,false,false,false,false,false,false,false,false,false,false,false,false,false,false,false,false,false,false,false,false,false,false,false,false,false,false,false,false,false,false,false,false,false,false,false,false,false,false,false,false,false,false,false,0]
[null,{"$f":"IF(Plantilla!D29<>0,Plantilla!D29,\"\")","v":""},null,null,null,null,null,null,null,null,null,null,null,null,null,null,null,null,null,null,null,null,null,null,null,null,null,null,null,null,null,null,null,null,null,null,null,null,null,null,null,null,null,null,null,null,null,null,null,null,null,null,null,null,null,null,null,0,"",0,0,0,0,0,0,0,0,0,0,0,0,0,0,0,0,0,0,0,0,0,0,0,0,0,0,0,0,0,0,0,0,0,0,0,0,0,0,0,0,0,0,0,0,0,0,0,0,0,0,0,0,0,0,null,false,false,false,false,false,false,false,false,false,false,false,false,false,false,false,false,false,false,false,false,false,false,false,false,false,false,false,false,false,false,false,false,false,false,false,false,false,false,false,false,false,false,false,false,false,false,false,false,false,false,false,false,false,false,0]
[null,{"$f":"IF(Plantilla!D30<>0,Plantilla!D30,\"\")","v":""},null,null,null,null,null,null,null,null,null,null,null,null,null,null,null,null,null,null,null,null,null,null,null,null,null,null,null,null,null,null,null,null,null,null,null,null,null,null,null,null,null,null,null,null,null,null,null,null,null,null,null,null,null,null,null,0,"",0,0,0,0,0,0,0,0,0,0,0,0,0,0,0,0,0,0,0,0,0,0,0,0,0,0,0,0,0,0,0,0,0,0,0,0,0,0,0,0,0,0,0,0,0,0,0,0,0,0,0,0,0,0,null,false,false,false,false,false,false,false,false,false,false,false,false,false,false,false,false,false,false,false,false,false,false,false,false,false,false,false,false,false,false,false,false,false,false,false,false,false,false,false,false,false,false,false,false,false,false,false,false,false,false,false,false,false,false,0]
[null,{"$f":"IF(Plantilla!D31<>0,Plantilla!D31,\"\")","v":""},null,null,null,null,null,null,null,null,null,null,null,null,null,null,null,null,null,null,null,null,null,null,null,null,null,null,null,null,null,null,null,null,null,null,null,null,null,null,null,null,null,null,null,null,null,null,null,null,null,null,null,null,null,null,null,0,"",0,0,0,0,0,0,0,0,0,0,0,0,0,0,0,0,0,0,0,0,0,0,0,0,0,0,0,0,0,0,0,0,0,0,0,0,0,0,0,0,0,0,0,0,0,0,0,0,0,0,0,0,0,0,null,false,false,false,false,false,false,false,false,false,false,false,false,false,false,false,false,false,false,false,false,false,false,false,false,false,false,false,false,false,false,false,false,false,false,false,false,false,false,false,false,false,false,false,false,false,false,false,false,false,false,false,false,false,false,0]
[null,{"$f":"IF(Plantilla!D32<>0,Plantilla!D32,\"\")","v":""},null,null,null,null,null,null,null,null,null,null,null,null,null,null,null,null,null,null,null,null,null,null,null,null,null,null,null,null,null,null,null,null,null,null,null,null,null,null,null,null,null,null,null,null,null,null,null,null,null,null,null,null,null,null,null,0,"",0,0,0,0,0,0,0,0,0,0,0,0,0,0,0,0,0,0,0,0,0,0,0,0,0,0,0,0,0,0,0,0,0,0,0,0,0,0,0,0,0,0,0,0,0,0,0,0,0,0,0,0,0,0,null,false,false,false,false,false,false,false,false,false,false,false,false,false,false,false,false,false,false,false,false,false,false,false,false,false,false,false,false,false,false,false,false,false,false,false,false,false,false,false,false,false,false,false,false,false,false,false,false,false,false,false,false,false,false,0]
[null,{"$f":"IF(Plantilla!D33<>0,Plantilla!D33,\"\")","v":""},null,null,null,null,null,null,null,null,null,null,null,null,null,null,null,null,null,null,null,null,null,null,null,null,null,null,null,null,null,null,null,null,null,null,null,null,null,null,null,null,null,null,null,null,null,null,null,null,null,null,null,null,null,null,null,0,"",0,0,0,0,0,0,0,0,0,0,0,0,0,0,0,0,0,0,0,0,0,0,0,0,0,0,0,0,0,0,0,0,0,0,0,0,0,0,0,0,0,0,0,0,0,0,0,0,0,0,0,0,0,0,null,false,false,false,false,false,false,false,false,false,false,false,false,false,false,false,false,false,false,false,false,false,false,false,false,false,false,false,false,false,false,false,false,false,false,false,false,false,false,false,false,false,false,false,false,false,false,false,false,false,false,false,false,false,false,0]
[null,{"$f":"'Consulta Corredor'!B2","v":"Samuel Sánchez"},{"$f":"INDEX(C7:C37,MATCH($B$38,corredores,0))","v":0},0,0,0,0,0,0,0,0,0,0,0,0,0,0,0,0,0,0,0,0,0,0,0,0,0,0,0,0,0,0,0,{"$f":"INDEX(AI7:AI37,MATCH($B$38,corredores,0))","v":0},0,0,0,0,0,0,0,0,0,0,0,0,0,0,0,0,0,0,0,0,0]
[null,null,{"$f":"IF(C38<>0,C2,\"\")","v":""},{"$f":"IF(D38<>0,D2,\"\")","v":""},"","","","","","","","","","","","","","","","","","","","","","","","","","","","","","","","","","","","","","","","","","","","","","","","","","","",""]
[null,null,{"$f":"IF(C38=1,C3,\"\")","v":""},"","","","","","","","","","","","","","","","","","","","","","","","","","","","","","","","","","","","","","","","","","","","","","","","","","","","",""]
[null,{"$f":"IF(Plantilla!C36<>0,Plantilla!C36,\"\")","v":"Totales"},{"$f":"BH41","v":0},{"$f":"BI41","v":0},0,0,0,0,0,0,0,0,0,0,0,0,0,0,0,0,0,0,0,0,0,0,0,0,0,0,0,0,0,0,0,0,0,0,0,0,0,0,0,0,0,0,0,0,0,0,0,0,0,0,0,0,null,null,null,{"$f":"SUM(BH7:BH37)","v":0},{"$f":"SUM(BI7:BI37)","v":0},0,0,0,0,0,0,0,0,0,0,0,0,0,0,0,0,0,0,0,0,0,0,0,0,0,0,0,0,0,0,0,0,0,0,0,0,0,0,0,0,0,0,0,0,0,0,0,0,0,0,0,0,null,"Numero de carreras:",null,null,null,54,null,null,null,null,null,null,null,null,null,null,null,null,null,null,null,null,null,null,null,null,null,null,null,null,null,null,null,null,null,null,null,null,null,null,null,null,null,null,null,null,null,null,null,null,null,null,null,null,null,{"$f":"SUM(C41:BD41)","v":0}]
[null,{"$f":"IF(Plantilla!D38<>0,Plantilla!D38,\"\")","v":""}]

{"sheet":"Etapas","index":10,"n_rows":15,"n_cols":2,"rows_kept":15,"cut":false,"hidden":false,"merged":[[1,1,1,2],[2,1,2,2]]}
[]
[null,"Ingresos por etapas"]
[null,"Ver premios"]
[null,"Enero"]
[null,"Febrero"]
[null,"Marzo"]
[null,"Abril"]
[null,"Mayo"]
[null,"Junio"]
[null,"Julio"]
[null,"Agosto"]
[null,"Septiembre"]
[null,"Octubre"]
[null,"Noviembre"]
[null,"Diciembre"]

{"sheet":"Consulta de Inscripciones","index":11,"n_rows":33,"n_cols":7,"rows_kept":33,"cut":false,"hidden":false,"merged":[[1,1,1,3]]}
[]
[null,"Santos Tour Down Under",null,null,"Numeros"]
[null,{"$f":"IFERROR(INDEX(Plantilla!$C$3:$C$39,MATCH('Consulta de Inscripciones'!C3,Plantilla!$D$3:$D$39,0)),\"\")","v":""},{"$f":"IF(Inscripciones!BF13<>0,Inscripciones!BF7,\"\")","v":""},"Lider",{"$f":"LOOKUP(D3,'Tipos de Corredor'!$A$2:$A$6,'Tipos de Corredor'!$B$2:$B$6)","v":1}]
[null,{"$f":"IFERROR(INDEX(Plantilla!$C$3:$C$39,MATCH('Consulta de Inscripciones'!C4,Plantilla!$D$3:$D$39,0)),\"\")","v":""},{"$f":"IF(Inscripciones!BF14<>0,Inscripciones!BF10,\"\")","v":""},"Esprinter",{"$f":"LOOKUP(D4,'Tipos de Corredor'!$A$2:$A$6,'Tipos de Corredor'!$B$2:$B$6)","v":2}]
[null,{"$f":"IFERROR(INDEX(Plantilla!$C$3:$C$39,MATCH('Consulta de Inscripciones'!C5,Plantilla!$D$3:$D$39,0)),\"\")","v":""},{"$f":"IF(Inscripciones!BF31<>0,Inscripciones!BF25,\"\")","v":""},"Libre",{"$f":"LOOKUP(D5,'Tipos de Corredor'!$A$2:$A$6,'Tipos de Corredor'!$B$2:$B$6)","v":3}]
[null,{"$f":"IFERROR(INDEX(Plantilla!$C$3:$C$39,MATCH('Consulta de Inscripciones'!C6,Plantilla!$D$3:$D$39,0)),\"\")","v":""},{"$f":"IF(Inscripciones!BF21<>0,Inscripciones!BF15,\"\")","v":""},"Libre",{"$f":"LOOKUP(D6,'Tipos de Corredor'!$A$2:$A$6,'Tipos de Corredor'!$B$2:$B$6)","v":3}]
[null,{"$f":"IFERROR(INDEX(Plantilla!$C$3:$C$39,MATCH('Consulta de Inscripciones'!C7,Plantilla!$D$3:$D$39,0)),\"\")","v":""},{"$f":"IF(Inscripciones!BF19<>0,Inscripciones!BF13,\"\")","v":""},"Gregario",{"$f":"LOOKUP(D7,'Tipos de Corredor'!$A$2:$A$6,'Tipos de Corredor'!$B$2:$B$6)","v":4},null,"lider"]
[null,{"$f":"IFERROR(INDEX(Plantilla!$C$3:$C$39,MATCH('Consulta de Inscripciones'!C8,Plantilla!$D$3:$D$39,0)),\"\")","v":""},{"$f":"IF(Inscripciones!BF23<>0,Inscripciones!BF17,\"\")","v":""},"Gregario",{"$f":"LOOKUP(D8,'Tipos de Corredor'!$A$2:$A$6,'Tipos de Corredor'!$B$2:$B$6)","v":4},null,"sprinter"]
[null,{"$f":"IFERROR(INDEX(Plantilla!$C$3:$C$39,MATCH('Consulta de Inscripciones'!C9,Plantilla!$D$3:$D$39,0)),\"\")","v":""},{"$f":"IF(Inscripciones!BF26<>0,Inscripciones!BF22,\"\")","v":""},"Gregario",{"$f":"LOOKUP(D9,'Tipos de Corredor'!$A$2:$A$6,'Tipos de Corredor'!$B$2:$B$6)","v":4},null,"libre"]
[null,{"$f":"IFERROR(INDEX(Plantilla!$C$3:$C$39,MATCH('Consulta de Inscripciones'!C10,Plantilla!$D$3:$D$39,0)),\"\")","v":""},{"$f":"IF(Inscripciones!BF15<>0,Inscripciones!BF9,\"\")","v":""},null,{"$f":"LOOKUP(D10,'Tipos de Corredor'!$A$2:$A$6,'Tipos de Corredor'!$B$2:$B$6)","v":{"$error":"#N/A"}},null,"libre"]
[null,{"$f":"IFERROR(INDEX(Plantilla!$C$3:$C$39,MATCH('Consulta de Inscripciones'!C11,Plantilla!$D$3:$D$39,0)),\"\")","v":""},{"$f":"IF(Inscripciones!BF11<>0,Inscripciones!BF6,\"\")","v":""},"",{"$f":"LOOKUP(D11,'Tipos de Corredor'!$A$2:$A$6,'Tipos de Corredor'!$B$2:$B$6)","v":{"$error":"#N/A"}},null,"gregarios"]
[null,{"$f":"IFERROR(INDEX(Plantilla!$C$3:$C$39,MATCH('Consulta de Inscripciones'!C12,Plantilla!$D$3:$D$39,0)),\"\")","v":""},{"$f":"IF(Inscripciones!BF17<>0,Inscripciones!BF11,\"\")","v":""},null,{"$f":"LOOKUP(D12,'Tipos de Corredor'!$A$2:$A$6,'Tipos de Corredor'!$B$2:$B$6)","v":{"$error":"#N/A"}}]
[null,{"$f":"IFERROR(INDEX(Plantilla!$C$3:$C$39,MATCH('Consulta de Inscripciones'!C13,Plantilla!$D$3:$D$39,0)),\"\")","v":""},{"$f":"IF(Inscripciones!BF12<>0,Inscripciones!BF8,\"\")","v":""},null,{"$f":"LOOKUP(D13,'Tipos de Corredor'!$A$2:$A$6,'Tipos de Corredor'!$B$2:$B$6)","v":{"$error":"#N/A"}}]
[null,{"$f":"IFERROR(INDEX(Plantilla!$C$3:$C$39,MATCH('Consulta de Inscripciones'!C14,Plantilla!$D$3:$D$39,0)),\"\")","v":""},{"$f":"IF(Inscripciones!BF27<>0,Inscripciones!BF21,\"\")","v":""},"",{"$f":"LOOKUP(D14,'Tipos de Corredor'!$A$2:$A$6,'Tipos de Corredor'!$B$2:$B$6)","v":{"$error":"#N/A"}}]
[null,{"$f":"IFERROR(INDEX(Plantilla!$C$3:$C$39,MATCH('Consulta de Inscripciones'!C15,Plantilla!$D$3:$D$39,0)),\"\")","v":""},{"$f":"IF(Inscripciones!BF16<>0,Inscripciones!BF12,\"\")","v":""},"",{"$f":"LOOKUP(D15,'Tipos de Corredor'!$A$2:$A$6,'Tipos de Corredor'!$B$2:$B$6)","v":{"$error":"#N/A"}}]
[null,{"$f":"IFERROR(INDEX(Plantilla!$C$3:$C$39,MATCH('Consulta de Inscripciones'!C16,Plantilla!$D$3:$D$39,0)),\"\")","v":""},{"$f":"IF(Inscripciones!BF25<>0,Inscripciones!BF19,\"\")","v":""},"",{"$f":"LOOKUP(D16,'Tipos de Corredor'!$A$2:$A$6,'Tipos de Corredor'!$B$2:$B$6)","v":{"$error":"#N/A"}}]
[null,{"$f":"IFERROR(INDEX(Plantilla!$C$3:$C$39,MATCH('Consulta de Inscripciones'!C17,Plantilla!$D$3:$D$39,0)),\"\")","v":""},{"$f":"IF(Inscripciones!BF24<>0,Inscripciones!BF20,\"\")","v":""},null,{"$f":"LOOKUP(D17,'Tipos de Corredor'!$A$2:$A$6,'Tipos de Corredor'!$B$2:$B$6)","v":{"$error":"#N/A"}}]
[null,{"$f":"IFERROR(INDEX(Plantilla!$C$3:$C$39,MATCH('Consulta de Inscripciones'!C18,Plantilla!$D$3:$D$39,0)),\"\")","v":""},{"$f":"IF(Inscripciones!BF20<>0,Inscripciones!BF16,\"\")","v":""},null,{"$f":"LOOKUP(D18,'Tipos de Corredor'!$A$2:$A$6,'Tipos de Corredor'!$B$2:$B$6)","v":{"$error":"#N/A"}}]
[null,{"$f":"IFERROR(INDEX(Plantilla!$C$3:$C$39,MATCH('Consulta de Inscripciones'!C19,Plantilla!$D$3:$D$39,0)),\"\")","v":""},{"$f":"IF(Inscripciones!BF28<>0,Inscripciones!BF24,\"\")","v":""},null,{"$f":"LOOKUP(D19,'Tipos de Corredor'!$A$2:$A$6,'Tipos de Corredor'!$B$2:$B$6)","v":{"$error":"#N/A"}}]
[null,{"$f":"IFERROR(INDEX(Plantilla!$C$3:$C$39,MATCH('Consulta de Inscripciones'!C20,Plantilla!$D$3:$D$39,0)),\"\")","v":""},{"$f":"IF(Inscripciones!BF29<>0,Inscripciones!BF23,\"\")","v":""},null,{"$f":"LOOKUP(D20,'Tipos de Corredor'!$A$2:$A$6,'Tipos de Corredor'!$B$2:$B$6)","v":{"$error":"#N/A"}}]
[null,{"$f":"IFERROR(INDEX(Plantilla!$C$3:$C$39,MATCH('Consulta de Inscripciones'!C21,Plantilla!$D$3:$D$39,0)),\"\")","v":""},{"$f":"IF(Inscripciones!BF22<>0,Inscripciones!BF18,\"\")","v":""},"",{"$f":"LOOKUP(D21,'Tipos de Corredor'!$A$2:$A$6,'Tipos de Corredor'!$B$2:$B$6)","v":{"$error":"#N/A"}}]
[null,{"$f":"IFERROR(INDEX(Plantilla!$C$3:$C$39,MATCH('Consulta de Inscripciones'!C22,Plantilla!$D$3:$D$39,0)),\"\")","v":""},{"$f":"IF(Inscripciones!BF18<>0,Inscripciones!BF14,\"\")","v":""},"",{"$f":"LOOKUP(D22,'Tipos de Corredor'!$A$2:$A$6,'Tipos de Corredor'!$B$2:$B$6)","v":{"$error":"#N/A"}}]
[null,{"$f":"IFERROR(INDEX(Plantilla!$C$3:$C$39,MATCH('Consulta de Inscripciones'!C23,Plantilla!$D$3:$D$39,0)),\"\")","v":""},{"$f":"IF(Inscripciones!BF30<>0,Inscripciones!BF26,\"\")","v":""},"",{"$f":"LOOKUP(D23,'Tipos de Corredor'!$A$2:$A$6,'Tipos de Corredor'!$B$2:$B$6)","v":{"$error":"#N/A"}}]
[null,{"$f":"IFERROR(INDEX(Plantilla!$C$3:$C$39,MATCH('Consulta de Inscripciones'!C24,Plantilla!$D$3:$D$39,0)),\"\")","v":""},{"$f":"IF(Inscripciones!BF33<>0,Inscripciones!BF27,\"\")","v":""},"",{"$f":"LOOKUP(D24,'Tipos de Corredor'!$A$2:$A$6,'Tipos de Corredor'!$B$2:$B$6)","v":{"$error":"#N/A"}}]
[null,{"$f":"IFERROR(INDEX(Plantilla!$C$3:$C$39,MATCH('Consulta de Inscripciones'!C25,Plantilla!$D$3:$D$39,0)),\"\")","v":""},{"$f":"IF(Inscripciones!BF32<>0,Inscripciones!BF28,\"\")","v":""},"",{"$f":"LOOKUP(D25,'Tipos de Corredor'!$A$2:$A$6,'Tipos de Corredor'!$B$2:$B$6)","v":{"$error":"#N/A"}}]
[null,{"$f":"IFERROR(INDEX(Plantilla!$C$3:$C$39,MATCH('Consulta de Inscripciones'!C26,Plantilla!$D$3:$D$39,0)),\"\")","v":""},{"$f":"IF(Inscripciones!BF35<>0,Inscripciones!BF29,\"\")","v":""},"",{"$f":"LOOKUP(D26,'Tipos de Corredor'!$A$2:$A$6,'Tipos de Corredor'!$B$2:$B$6)","v":{"$error":"#N/A"}}]
[null,{"$f":"IFERROR(INDEX(Plantilla!$C$3:$C$39,MATCH('Consulta de Inscripciones'!C27,Plantilla!$D$3:$D$39,0)),\"\")","v":""},{"$f":"IF(Inscripciones!BF34<>0,Inscripciones!BF30,\"\")","v":""},"",{"$f":"LOOKUP(D27,'Tipos de Corredor'!$A$2:$A$6,'Tipos de Corredor'!$B$2:$B$6)","v":{"$error":"#N/A"}}]
[null,{"$f":"IFERROR(INDEX(Plantilla!$C$3:$C$39,MATCH('Consulta de Inscripciones'!C28,Plantilla!$D$3:$D$39,0)),\"\")","v":""},{"$f":"IF(Inscripciones!BF37<>0,Inscripciones!BF31,\"\")","v":""},"",{"$f":"LOOKUP(D28,'Tipos de Corredor'!$A$2:$A$6,'Tipos de Corredor'!$B$2:$B$6)","v":{"$error":"#N/A"}}]
[null,{"$f":"IFERROR(INDEX(Plantilla!$C$3:$C$39,MATCH('Consulta de Inscripciones'!C29,Plantilla!$D$3:$D$39,0)),\"\")","v":""},{"$f":"IF(Inscripciones!BF36<>0,Inscripciones!BF32,\"\")","v":""},"",{"$f":"LOOKUP(D29,'Tipos de Corredor'!$A$2:$A$6,'Tipos de Corredor'!$B$2:$B$6)","v":{"$error":"#N/A"}}]
[null,{"$f":"IFERROR(INDEX(Plantilla!$C$3:$C$39,MATCH('Consulta de Inscripciones'!C30,Plantilla!$D$3:$D$39,0)),\"\")","v":""},{"$f":"IF(Inscripciones!BF39<>0,Inscripciones!BF33,\"\")","v":""},"",{"$f":"LOOKUP(D30,'Tipos de Corredor'!$A$2:$A$6,'Tipos de Corredor'!$B$2:$B$6)","v":{"$error":"#N/A"}}]
[null,{"$f":"IFERROR(INDEX(Plantilla!$C$3:$C$39,MATCH('Consulta de Inscripciones'!C31,Plantilla!$D$3:$D$39,0)),\"\")","v":""},{"$f":"IF(Inscripciones!BF38<>0,Inscripciones!BF34,\"\")","v":""},"",{"$f":"LOOKUP(D31,'Tipos de Corredor'!$A$2:$A$6,'Tipos de Corredor'!$B$2:$B$6)","v":{"$error":"#N/A"}}]
[null,{"$f":"IFERROR(INDEX(Plantilla!$C$3:$C$39,MATCH('Consulta de Inscripciones'!C32,Plantilla!$D$3:$D$39,0)),\"\")","v":""},{"$f":"IF(Inscripciones!BF41<>0,Inscripciones!BF35,\"\")","v":""},"",{"$f":"LOOKUP(D32,'Tipos de Corredor'!$A$2:$A$6,'Tipos de Corredor'!$B$2:$B$6)","v":{"$error":"#N/A"}}]
[null,{"$f":"IFERROR(INDEX(Plantilla!$C$3:$C$39,MATCH('Consulta de Inscripciones'!C33,Plantilla!$D$3:$D$39,0)),\"\")","v":""},{"$f":"IF(Inscripciones!BF40<>0,Inscripciones!BF36,\"\")","v":""},null,{"$f":"LOOKUP(D33,'Tipos de Corredor'!$A$2:$A$6,'Tipos de Corredor'!$B$2:$B$6)","v":{"$error":"#N/A"}}]

{"sheet":"Consulta Corredor","index":12,"n_rows":57,"n_cols":9,"rows_kept":57,"cut":false,"hidden":false,"merged":[[1,1,1,3],[1,6,1,8]]}
[]
[null,{"$f":"G2","v":"Samuel Sánchez"},null,null,null,null,"Samuel Sánchez"]
[null,null,"Carrera",null,null,null,null,"Carrera","Días"]
[null,{"$f":"IFERROR(INDEX(Plantilla!$C$3:$C$39,MATCH('Consulta de Inscripciones'!B2,Plantilla!$D$3:$D$39,0)),\"\")","v":""},{"$f":"TRANSPOSE(Inscripciones!C38:BD38)","v":""},{"$f":"IF(E4<>0,CONCATENATE(\"(\",E4,\"días\",\")\"),\"\")","v":"(días)"},{"$f":"TRANSPOSE(Inscripciones!C39:BD39)","v":""},null,"","Lieja-Bastoña-Lieja","(1días)"]
[null,{"$f":"IFERROR(INDEX(Plantilla!$C$3:$C$39,MATCH('Consulta de Inscripciones'!B3,Plantilla!$D$3:$D$39,0)),\"\")","v":""},"",{"$f":"IF(E5<>0,CONCATENATE(\"(\",E5,\"días\",\")\"),\"\")","v":"(días)"},"",null,"","GP de Lombardía","(1días)"]
[null,{"$f":"IFERROR(INDEX(Plantilla!$C$3:$C$39,MATCH('Consulta de Inscripciones'!B4,Plantilla!$D$3:$D$39,0)),\"\")","v":""},"","(días)","",null,"","Flecha Valona","(1días)"]
[null,null,"","(días)","",null,null,"Critérium International","(3días)"]
[null,null,"","(días)","",null,null,"Clásica San Sebastián","(1días)"]
[null,{"$f":"IFERROR(INDEX(Plantilla!$C$3:$C$39,MATCH('Consulta de Inscripciones'!B5,Plantilla!$D$3:$D$39,0)),\"\")","v":""},"","(días)","",null,"","Chrono des Nations","(1días)"]
[null,{"$f":"IFERROR(INDEX(Plantilla!$C$3:$C$39,MATCH('Consulta de Inscripciones'!B6,Plantilla!$D$3:$D$39,0)),\"\")","v":""},"","(días)","",null,"","Campeonatos del Mundo: Contrarreloj por Equipos","(1días)"]
[null,{"$f":"IFERROR(INDEX(Plantilla!$C$3:$C$39,MATCH('Consulta de Inscripciones'!B7,Plantilla!$D$3:$D$39,0)),\"\")","v":""},"","(días)","",null,"","Campeonatos del Mundo: Contrarreloj Individual ","(1días)"]
[null,{"$f":"IFERROR(INDEX(Plantilla!$C$3:$C$39,MATCH('Consulta de Inscripciones'!B8,Plantilla!$D$3:$D$39,0)),\"\")","v":""},"","(días)","",null,"","Campeonatos del Mundo en Ruta","(1días)"]
[null,{"$f":"IFERROR(INDEX(Plantilla!$C$3:$C$39,MATCH('Consulta de Inscripciones'!B9,Plantilla!$D$3:$D$39,0)),\"\")","v":""},"","(días)","",null,"","Amstel Gold Race","(1días)"]
[null,{"$f":"IFERROR(INDEX(Plantilla!$C$3:$C$39,MATCH('Consulta de Inscripciones'!B10,Plantilla!$D$3:$D$39,0)),\"\")","v":""},"","(días)","",null,"","","(días)"]
[null,{"$f":"IFERROR(INDEX(Plantilla!$C$3:$C$39,MATCH('Consulta de Inscripciones'!B11,Plantilla!$D$3:$D$39,0)),\"\")","v":""},"","(días)","",null,"","","(días)"]
[null,null,"","(días)","",null,null,"","(días)"]
[null,null,"","(días)","",null,null,"","(días)"]
[null,null,"","(días)","",null,null,"","(días)"]
[null,null,"","(días)","",null,null,"","(días)"]
[null,null,"","(días)","",null,null,"","(días)"]
[null,null,"","(días)","",null,null,"","(días)"]
[null,null,"","(días)","",null,null,"","(días)"]
[null,null,"","(días)","",null,null,"","(días)"]
[null,null,"","(días)","",null,null,"","(días)"]
[null,null,"","(días)","",null,null,"","(días)"]
[null,null,"","(días)","",null,null,"","(días)"]
[null,null,"","(días)","",null,null,"","(días)"]
[null,null,"","(días)","",null,null,"","(días)"]
[null,null,"","(días)","",null,null,"","(días)"]
[null,null,"","(días)","",null,null,"","(días)"]
[null,null,"","(días)","",null,null,"","(días)"]
[null,null,"","(días)","",null,null,"","(días)"]
[null,null,"","(días)","",null,null,"","(días)"]
[null,null,"","(días)","",null,null,"","(días)"]
[null,null,"","(días)","",null,null,"","(días)"]
[null,null,"","(días)","",null,null,"","(días)"]
[null,{"$f":"IFERROR(INDEX(Plantilla!$C$3:$C$39,MATCH('Consulta de Inscripciones'!B12,Plantilla!$D$3:$D$39,0)),\"\")","v":""},"","(días)","",null,"","","(días)"]
[null,{"$f":"IFERROR(INDEX(Plantilla!$C$3:$C$39,MATCH('Consulta de Inscripciones'!B13,Plantilla!$D$3:$D$39,0)),\"\")","v":""},"","(días)","",null,"","","(días)"]
[null,{"$f":"IFERROR(INDEX(Plantilla!$C$3:$C$39,MATCH('Consulta de Inscripciones'!B14,Plantilla!$D$3:$D$39,0)),\"\")","v":""},"","(días)","",null,"","","(días)"]
[null,{"$f":"IFERROR(INDEX(Plantilla!$C$3:$C$39,MATCH('Consulta de Inscripciones'!B15,Plantilla!$D$3:$D$39,0)),\"\")","v":""},"","(días)","",null,"","","(días)"]
[null,{"$f":"IFERROR(INDEX(Plantilla!$C$3:$C$39,MATCH('Consulta de Inscripciones'!B16,Plantilla!$D$3:$D$39,0)),\"\")","v":""},"","(días)","",null,"","","(días)"]
[null,{"$f":"IFERROR(INDEX(Plantilla!$C$3:$C$39,MATCH('Consulta de Inscripciones'!B17,Plantilla!$D$3:$D$39,0)),\"\")","v":""},"","(días)","",null,"","","(días)"]
[null,{"$f":"IFERROR(INDEX(Plantilla!$C$3:$C$39,MATCH('Consulta de Inscripciones'!B18,Plantilla!$D$3:$D$39,0)),\"\")","v":""},"","(días)","",null,"","","(días)"]
[null,{"$f":"IFERROR(INDEX(Plantilla!$C$3:$C$39,MATCH('Consulta de Inscripciones'!B19,Plantilla!$D$3:$D$39,0)),\"\")","v":""},"","(días)","",null,"","","(días)"]
[null,{"$f":"IFERROR(INDEX(Plantilla!$C$3:$C$39,MATCH('Consulta de Inscripciones'!B20,Plantilla!$D$3:$D$39,0)),\"\")","v":""},"","(días)","",null,"","","(días)"]
[null,{"$f":"IFERROR(INDEX(Plantilla!$C$3:$C$39,MATCH('Consulta de Inscripciones'!B21,Plantilla!$D$3:$D$39,0)),\"\")","v":""},"","(días)","",null,"","","(días)"]
[null,{"$f":"IFERROR(INDEX(Plantilla!$C$3:$C$39,MATCH('Consulta de Inscripciones'!B22,Plantilla!$D$3:$D$39,0)),\"\")","v":""},"","(días)","",null,"","","(días)"]
[null,{"$f":"IFERROR(INDEX(Plantilla!$C$3:$C$39,MATCH('Consulta de Inscripciones'!B23,Plantilla!$D$3:$D$39,0)),\"\")","v":""},"","(días)","",null,"","","(días)"]
[null,{"$f":"IFERROR(INDEX(Plantilla!$C$3:$C$39,MATCH('Consulta de Inscripciones'!B24,Plantilla!$D$3:$D$39,0)),\"\")","v":""},"","(días)","",null,"","","(días)"]
[null,{"$f":"IFERROR(INDEX(Plantilla!$C$3:$C$39,MATCH('Consulta de Inscripciones'!B25,Plantilla!$D$3:$D$39,0)),\"\")","v":""},"","(días)","",null,"","","(días)"]
[null,{"$f":"IFERROR(INDEX(Plantilla!$C$3:$C$39,MATCH('Consulta de Inscripciones'!B26,Plantilla!$D$3:$D$39,0)),\"\")","v":""},"","(días)","",null,"","","(días)"]
[null,{"$f":"IFERROR(INDEX(Plantilla!$C$3:$C$39,MATCH('Consulta de Inscripciones'!B27,Plantilla!$D$3:$D$39,0)),\"\")","v":""},"","(días)","",null,"","","(días)"]
[null,{"$f":"IFERROR(INDEX(Plantilla!$C$3:$C$39,MATCH('Consulta de Inscripciones'!B28,Plantilla!$D$3:$D$39,0)),\"\")","v":""},"","(días)","",null,"","","(días)"]
[null,{"$f":"IFERROR(INDEX(Plantilla!$C$3:$C$39,MATCH('Consulta de Inscripciones'!B29,Plantilla!$D$3:$D$39,0)),\"\")","v":""},"","(días)","",null,"","","(días)"]
[null,{"$f":"IFERROR(INDEX(Plantilla!$C$3:$C$39,MATCH('Consulta de Inscripciones'!B30,Plantilla!$D$3:$D$39,0)),\"\")","v":""},"","(días)","",null,"","","(días)"]
[null,{"$f":"IFERROR(INDEX(Plantilla!$C$3:$C$39,MATCH('Consulta de Inscripciones'!B31,Plantilla!$D$3:$D$39,0)),\"\")","v":""},"","(días)","",null,"","","(días)"]
[null,{"$f":"IFERROR(INDEX(Plantilla!$C$3:$C$39,MATCH('Consulta de Inscripciones'!B32,Plantilla!$D$3:$D$39,0)),\"\")","v":""},0,"",0,null,"",0,"(12días)"]

{"sheet":"Consulta General","index":13,"n_rows":57,"n_cols":10,"rows_kept":57,"cut":false,"hidden":false,"merged":[[1,1,1,3],[1,7,1,8]]}
[]
[null,{"$f":"H2","v":"Vincenzo Nibali"},null,null,null,null,null,"Vincenzo Nibali"]
[null,null,"Pos","Carrera",null,null,null,"Pos","Carrera"]
[null,{"$f":"IFERROR(INDEX(Plantilla!$C$3:$C$39,MATCH('Consulta de Inscripciones'!B2,Plantilla!$D$3:$D$39,0)),\"\")","v":""},{"$f":"TRANSPOSE(General!C38:BD38)","v":0},{"$f":"TRANSPOSE(General!C39:BD39)","v":""},null,null,"",3,"Chrono des Nations"]
[null,{"$f":"IFERROR(INDEX(Plantilla!$C$3:$C$39,MATCH('Consulta de Inscripciones'!B3,Plantilla!$D$3:$D$39,0)),\"\")","v":""},0,"",null,null,"",1,"Campeonatos del Mundo: Contrarreloj por Equipos"]
[null,{"$f":"IFERROR(INDEX(Plantilla!$C$3:$C$39,MATCH('Consulta de Inscripciones'!B4,Plantilla!$D$3:$D$39,0)),\"\")","v":""},0,"",null,null,"",0,""]
[null,null,0,"",null,null,null,0,""]
[null,null,0,"",null,null,null,0,""]
[null,{"$f":"IFERROR(INDEX(Plantilla!$C$3:$C$39,MATCH('Consulta de Inscripciones'!B5,Plantilla!$D$3:$D$39,0)),\"\")","v":""},0,"",null,null,"",0,""]
[null,{"$f":"IFERROR(INDEX(Plantilla!$C$3:$C$39,MATCH('Consulta de Inscripciones'!B6,Plantilla!$D$3:$D$39,0)),\"\")","v":""},0,"",null,null,"",0,""]
[null,{"$f":"IFERROR(INDEX(Plantilla!$C$3:$C$39,MATCH('Consulta de Inscripciones'!B7,Plantilla!$D$3:$D$39,0)),\"\")","v":""},0,"",null,null,"",0,""]
[null,{"$f":"IFERROR(INDEX(Plantilla!$C$3:$C$39,MATCH('Consulta de Inscripciones'!B8,Plantilla!$D$3:$D$39,0)),\"\")","v":""},0,"",null,null,"",0,""]
[null,{"$f":"IFERROR(INDEX(Plantilla!$C$3:$C$39,MATCH('Consulta de Inscripciones'!B9,Plantilla!$D$3:$D$39,0)),\"\")","v":""},0,"",null,null,"",0,""]
[null,{"$f":"IFERROR(INDEX(Plantilla!$C$3:$C$39,MATCH('Consulta de Inscripciones'!B10,Plantilla!$D$3:$D$39,0)),\"\")","v":""},0,"",null,null,"",0,""]
[null,{"$f":"IFERROR(INDEX(Plantilla!$C$3:$C$39,MATCH('Consulta de Inscripciones'!B11,Plantilla!$D$3:$D$39,0)),\"\")","v":""},0,"",null,null,"",0,""]
[null,null,0,"",null,null,null,0,""]
[null,null,0,"",null,null,null,0,""]
[null,null,0,"",null,null,null,0,""]
[null,null,0,"",null,null,null,0,""]
[null,null,0,"",null,null,null,0,""]
[null,null,0,"",null,null,null,0,""]
[null,null,0,"",null,null,null,0,""]
[null,null,0,"",null,null,null,0,""]
[null,null,0,"",null,null,null,0,"",""]
[null,null,0,"",null,null,null,0,"",""]
[null,null,0,"",null,null,null,0,"",""]
[null,null,0,"",null,null,null,0,"",""]
[null,null,0,"",null,null,null,0,"",""]
[null,null,0,"",null,null,null,0,"",""]
[null,null,0,"",null,null,null,0,"",""]
[null,null,0,"",null,null,null,0,"",""]
[null,null,0,"",null,null,null,0,"",""]
[null,null,0,"",null,null,null,0,"",""]
[null,null,0,"",null,null,null,0,"",""]
[null,null,0,"",null,null,null,0,"",""]
[null,null,0,"",null,null,null,0,"",""]
[null,{"$f":"IFERROR(INDEX(Plantilla!$C$3:$C$39,MATCH('Consulta de Inscripciones'!B12,Plantilla!$D$3:$D$39,0)),\"\")","v":""},0,"",null,null,"",0,"",""]
[null,{"$f":"IFERROR(INDEX(Plantilla!$C$3:$C$39,MATCH('Consulta de Inscripciones'!B13,Plantilla!$D$3:$D$39,0)),\"\")","v":""},0,"",null,null,"",0,"",""]
[null,{"$f":"IFERROR(INDEX(Plantilla!$C$3:$C$39,MATCH('Consulta de Inscripciones'!B14,Plantilla!$D$3:$D$39,0)),\"\")","v":""},0,"",null,null,"",0,"",""]
[null,{"$f":"IFERROR(INDEX(Plantilla!$C$3:$C$39,MATCH('Consulta de Inscripciones'!B15,Plantilla!$D$3:$D$39,0)),\"\")","v":""},0,"",null,null,"",0,"",""]
[null,{"$f":"IFERROR(INDEX(Plantilla!$C$3:$C$39,MATCH('Consulta de Inscripciones'!B16,Plantilla!$D$3:$D$39,0)),\"\")","v":""},0,"",null,null,"",0,"",""]
[null,{"$f":"IFERROR(INDEX(Plantilla!$C$3:$C$39,MATCH('Consulta de Inscripciones'!B17,Plantilla!$D$3:$D$39,0)),\"\")","v":""},0,"",null,null,"",0,"",""]
[null,{"$f":"IFERROR(INDEX(Plantilla!$C$3:$C$39,MATCH('Consulta de Inscripciones'!B18,Plantilla!$D$3:$D$39,0)),\"\")","v":""},0,"",null,null,"",0,"",""]
[null,{"$f":"IFERROR(INDEX(Plantilla!$C$3:$C$39,MATCH('Consulta de Inscripciones'!B19,Plantilla!$D$3:$D$39,0)),\"\")","v":""},0,"",null,null,"",0,"",""]
[null,{"$f":"IFERROR(INDEX(Plantilla!$C$3:$C$39,MATCH('Consulta de Inscripciones'!B20,Plantilla!$D$3:$D$39,0)),\"\")","v":""},0,"",null,null,"",0,"",""]
[null,{"$f":"IFERROR(INDEX(Plantilla!$C$3:$C$39,MATCH('Consulta de Inscripciones'!B21,Plantilla!$D$3:$D$39,0)),\"\")","v":""},0,"",null,null,"",0,"",""]
[null,{"$f":"IFERROR(INDEX(Plantilla!$C$3:$C$39,MATCH('Consulta de Inscripciones'!B22,Plantilla!$D$3:$D$39,0)),\"\")","v":""},0,"",null,null,"",0,"",""]
[null,{"$f":"IFERROR(INDEX(Plantilla!$C$3:$C$39,MATCH('Consulta de Inscripciones'!B23,Plantilla!$D$3:$D$39,0)),\"\")","v":""},0,"",null,null,"",0,"",""]
[null,{"$f":"IFERROR(INDEX(Plantilla!$C$3:$C$39,MATCH('Consulta de Inscripciones'!B24,Plantilla!$D$3:$D$39,0)),\"\")","v":""},0,"",null,null,"",0,"",""]
[null,{"$f":"IFERROR(INDEX(Plantilla!$C$3:$C$39,MATCH('Consulta de Inscripciones'!B25,Plantilla!$D$3:$D$39,0)),\"\")","v":""},0,"",null,null,"",0,"",""]
[null,{"$f":"IFERROR(INDEX(Plantilla!$C$3:$C$39,MATCH('Consulta de Inscripciones'!B26,Plantilla!$D$3:$D$39,0)),\"\")","v":""},0,"",null,null,"",0,"",""]
[null,{"$f":"IFERROR(INDEX(Plantilla!$C$3:$C$39,MATCH('Consulta de Inscripciones'!B27,Plantilla!$D$3:$D$39,0)),\"\")","v":""},0,"",null,null,"",0,"",""]
[null,{"$f":"IFERROR(INDEX(Plantilla!$C$3:$C$39,MATCH('Consulta de Inscripciones'!B28,Plantilla!$D$3:$D$39,0)),\"\")","v":""},0,"",null,null,"",0,"",""]
[null,{"$f":"IFERROR(INDEX(Plantilla!$C$3:$C$39,MATCH('Consulta de Inscripciones'!B29,Plantilla!$D$3:$D$39,0)),\"\")","v":""},0,"",null,null,"",0,"",""]
[null,{"$f":"IFERROR(INDEX(Plantilla!$C$3:$C$39,MATCH('Consulta de Inscripciones'!B30,Plantilla!$D$3:$D$39,0)),\"\")","v":""},0,"",null,null,"",0,"",""]
[null,{"$f":"IFERROR(INDEX(Plantilla!$C$3:$C$39,MATCH('Consulta de Inscripciones'!B31,Plantilla!$D$3:$D$39,0)),\"\")","v":""},0,"",null,null,"",0,"",""]
[null,{"$f":"IFERROR(INDEX(Plantilla!$C$3:$C$39,MATCH('Consulta de Inscripciones'!B32,Plantilla!$D$3:$D$39,0)),\"\")","v":""},0,"",null,null,"",0,""]

{"sheet":"Consulta Regularidad","index":14,"n_rows":57,"n_cols":10,"rows_kept":57,"cut":false,"hidden":false,"merged":[[1,1,1,3],[1,7,1,8]]}
[]
[null,{"$f":"H2","v":"Simon Gerrans"},null,null,null,null,null,"Simon Gerrans"]
[null,null,"Pos","Carrera",null,null,null,"Pos","Carrera"]
[null,{"$f":"IFERROR(INDEX(Plantilla!$C$3:$C$39,MATCH('Consulta de Inscripciones'!B2,Plantilla!$D$3:$D$39,0)),\"\")","v":""},{"$f":"TRANSPOSE(Regularidad!C38:BD38)","v":0},{"$f":"TRANSPOSE(Regularidad!C39:BD39)","v":""},null,null,"",1,"Tour de France"]
[null,{"$f":"IFERROR(INDEX(Plantilla!$C$3:$C$39,MATCH('Consulta de Inscripciones'!B3,Plantilla!$D$3:$D$39,0)),\"\")","v":""},0,"",null,null,"",0,""]
[null,{"$f":"IFERROR(INDEX(Plantilla!$C$3:$C$39,MATCH('Consulta de Inscripciones'!B4,Plantilla!$D$3:$D$39,0)),\"\")","v":""},0,"",null,null,"",0,""]
[null,null,0,"",null,null,null,0,""]
[null,null,0,"",null,null,null,0,""]
[null,{"$f":"IFERROR(INDEX(Plantilla!$C$3:$C$39,MATCH('Consulta de Inscripciones'!B5,Plantilla!$D$3:$D$39,0)),\"\")","v":""},0,"",null,null,"",0,""]
[null,{"$f":"IFERROR(INDEX(Plantilla!$C$3:$C$39,MATCH('Consulta de Inscripciones'!B6,Plantilla!$D$3:$D$39,0)),\"\")","v":""},0,"",null,null,"",0,""]
[null,{"$f":"IFERROR(INDEX(Plantilla!$C$3:$C$39,MATCH('Consulta de Inscripciones'!B7,Plantilla!$D$3:$D$39,0)),\"\")","v":""},0,"",null,null,"",0,""]
[null,{"$f":"IFERROR(INDEX(Plantilla!$C$3:$C$39,MATCH('Consulta de Inscripciones'!B8,Plantilla!$D$3:$D$39,0)),\"\")","v":""},0,"",null,null,"",0,""]
[null,{"$f":"IFERROR(INDEX(Plantilla!$C$3:$C$39,MATCH('Consulta de Inscripciones'!B9,Plantilla!$D$3:$D$39,0)),\"\")","v":""},0,"",null,null,"",0,""]
[null,{"$f":"IFERROR(INDEX(Plantilla!$C$3:$C$39,MATCH('Consulta de Inscripciones'!B10,Plantilla!$D$3:$D$39,0)),\"\")","v":""},0,"",null,null,"",0,""]
[null,{"$f":"IFERROR(INDEX(Plantilla!$C$3:$C$39,MATCH('Consulta de Inscripciones'!B11,Plantilla!$D$3:$D$39,0)),\"\")","v":""},0,"",null,null,"",0,""]
[null,null,0,"",null,null,null,0,""]
[null,null,0,"",null,null,null,0,""]
[null,null,0,"",null,null,null,0,""]
[null,null,0,"",null,null,null,0,""]
[null,null,0,"",null,null,null,0,""]
[null,null,0,"",null,null,null,0,""]
[null,null,0,"",null,null,null,0,""]
[null,null,0,"",null,null,null,0,""]
[null,null,0,"",null,null,null,0,"",""]
[null,null,0,"",null,null,null,0,"",""]
[null,null,0,"",null,null,null,0,"",""]
[null,null,0,"",null,null,null,0,"",""]
[null,null,0,"",null,null,null,0,"",""]
[null,null,0,"",null,null,null,0,"",""]
[null,null,0,"",null,null,null,0,"",""]
[null,null,0,"",null,null,null,0,"",""]
[null,null,0,"",null,null,null,0,"",""]
[null,null,0,"",null,null,null,0,"",""]
[null,null,0,"",null,null,null,0,"",""]
[null,null,0,"",null,null,null,0,"",""]
[null,null,0,"",null,null,null,0,"",""]
[null,{"$f":"IFERROR(INDEX(Plantilla!$C$3:$C$39,MATCH('Consulta de Inscripciones'!B12,Plantilla!$D$3:$D$39,0)),\"\")","v":""},0,"",null,null,"",0,"",""]
[null,{"$f":"IFERROR(INDEX(Plantilla!$C$3:$C$39,MATCH('Consulta de Inscripciones'!B13,Plantilla!$D$3:$D$39,0)),\"\")","v":""},0,"",null,null,"",0,"",""]
[null,{"$f":"IFERROR(INDEX(Plantilla!$C$3:$C$39,MATCH('Consulta de Inscripciones'!B14,Plantilla!$D$3:$D$39,0)),\"\")","v":""},0,"",null,null,"",0,"",""]
[null,{"$f":"IFERROR(INDEX(Plantilla!$C$3:$C$39,MATCH('Consulta de Inscripciones'!B15,Plantilla!$D$3:$D$39,0)),\"\")","v":""},0,"",null,null,"",0,"",""]
[null,{"$f":"IFERROR(INDEX(Plantilla!$C$3:$C$39,MATCH('Consulta de Inscripciones'!B16,Plantilla!$D$3:$D$39,0)),\"\")","v":""},0,"",null,null,"",0,"",""]
[null,{"$f":"IFERROR(INDEX(Plantilla!$C$3:$C$39,MATCH('Consulta de Inscripciones'!B17,Plantilla!$D$3:$D$39,0)),\"\")","v":""},0,"",null,null,"",0,"",""]
[null,{"$f":"IFERROR(INDEX(Plantilla!$C$3:$C$39,MATCH('Consulta de Inscripciones'!B18,Plantilla!$D$3:$D$39,0)),\"\")","v":""},0,"",null,null,"",0,"",""]
[null,{"$f":"IFERROR(INDEX(Plantilla!$C$3:$C$39,MATCH('Consulta de Inscripciones'!B19,Plantilla!$D$3:$D$39,0)),\"\")","v":""},0,"",null,null,"",0,"",""]
[null,{"$f":"IFERROR(INDEX(Plantilla!$C$3:$C$39,MATCH('Consulta de Inscripciones'!B20,Plantilla!$D$3:$D$39,0)),\"\")","v":""},0,"",null,null,"",0,"",""]
[null,{"$f":"IFERROR(INDEX(Plantilla!$C$3:$C$39,MATCH('Consulta de Inscripciones'!B21,Plantilla!$D$3:$D$39,0)),\"\")","v":""},0,"",null,null,"",0,"",""]
[null,{"$f":"IFERROR(INDEX(Plantilla!$C$3:$C$39,MATCH('Consulta de Inscripciones'!B22,Plantilla!$D$3:$D$39,0)),\"\")","v":""},0,"",null,null,"",0,"",""]
[null,{"$f":"IFERROR(INDEX(Plantilla!$C$3:$C$39,MATCH('Consulta de Inscripciones'!B23,Plantilla!$D$3:$D$39,0)),\"\")","v":""},0,"",null,null,"",0,"",""]
[null,{"$f":"IFERROR(INDEX(Plantilla!$C$3:$C$39,MATCH('Consulta de Inscripciones'!B24,Plantilla!$D$3:$D$39,0)),\"\")","v":""},0,"",null,null,"",0,"",""]
[null,{"$f":"IFERROR(INDEX(Plantilla!$C$3:$C$39,MATCH('Consulta de Inscripciones'!B25,Plantilla!$D$3:$D$39,0)),\"\")","v":""},0,"",null,null,"",0,"",""]
[null,{"$f":"IFERROR(INDEX(Plantilla!$C$3:$C$39,MATCH('Consulta de Inscripciones'!B26,Plantilla!$D$3:$D$39,0)),\"\")","v":""},0,"",null,null,"",0,"",""]
[null,{"$f":"IFERROR(INDEX(Plantilla!$C$3:$C$39,MATCH('Consulta de Inscripciones'!B27,Plantilla!$D$3:$D$39,0)),\"\")","v":""},0,"",null,null,"",0,"",""]
[null,{"$f":"IFERROR(INDEX(Plantilla!$C$3:$C$39,MATCH('Consulta de Inscripciones'!B28,Plantilla!$D$3:$D$39,0)),\"\")","v":""},0,"",null,null,"",0,"",""]
[null,{"$f":"IFERROR(INDEX(Plantilla!$C$3:$C$39,MATCH('Consulta de Inscripciones'!B29,Plantilla!$D$3:$D$39,0)),\"\")","v":""},0,"",null,null,"",0,"",""]
[null,{"$f":"IFERROR(INDEX(Plantilla!$C$3:$C$39,MATCH('Consulta de Inscripciones'!B30,Plantilla!$D$3:$D$39,0)),\"\")","v":""},0,"",null,null,"",0,"",""]
[null,{"$f":"IFERROR(INDEX(Plantilla!$C$3:$C$39,MATCH('Consulta de Inscripciones'!B31,Plantilla!$D$3:$D$39,0)),\"\")","v":""},0,"",null,null,"",0,"",""]
[null,{"$f":"IFERROR(INDEX(Plantilla!$C$3:$C$39,MATCH('Consulta de Inscripciones'!B32,Plantilla!$D$3:$D$39,0)),\"\")","v":""},0,"",null,null,"",0,""]

{"sheet":"Consulta Montana","index":15,"n_rows":57,"n_cols":10,"rows_kept":57,"cut":false,"hidden":false,"merged":[[1,1,1,3],[1,7,1,8]]}
[]
[null,{"$f":"H2","v":"Simon Gerrans"},null,null,null,null,null,"Simon Gerrans"]
[null,null,"Pos","Carrera",null,null,null,"Pos","Carrera"]
[null,{"$f":"IFERROR(INDEX(Plantilla!$C$3:$C$39,MATCH('Consulta de Inscripciones'!B2,Plantilla!$D$3:$D$39,0)),\"\")","v":""},{"$f":"TRANSPOSE(Regularidad!C38:BD38)","v":0},{"$f":"TRANSPOSE(Regularidad!C39:BD39)","v":""},null,null,"",2,"Santos Tour Down Under (6 Dias) -- TV"]
[null,{"$f":"IFERROR(INDEX(Plantilla!$C$3:$C$39,MATCH('Consulta de Inscripciones'!B3,Plantilla!$D$3:$D$39,0)),\"\")","v":""},0,"",null,null,"",4,"Omloop Het Niewsblad (1 Día) -- TC"]
[null,{"$f":"IFERROR(INDEX(Plantilla!$C$3:$C$39,MATCH('Consulta de Inscripciones'!B4,Plantilla!$D$3:$D$39,0)),\"\")","v":""},0,"",null,null,"",0,""]
[null,null,0,"",null,null,null,0,""]
[null,null,0,"",null,null,null,0,""]
[null,{"$f":"IFERROR(INDEX(Plantilla!$C$3:$C$39,MATCH('Consulta de Inscripciones'!B5,Plantilla!$D$3:$D$39,0)),\"\")","v":""},0,"",null,null,"",0,""]
[null,{"$f":"IFERROR(INDEX(Plantilla!$C$3:$C$39,MATCH('Consulta de Inscripciones'!B6,Plantilla!$D$3:$D$39,0)),\"\")","v":""},0,"",null,null,"",0,""]
[null,{"$f":"IFERROR(INDEX(Plantilla!$C$3:$C$39,MATCH('Consulta de Inscripciones'!B7,Plantilla!$D$3:$D$39,0)),\"\")","v":""},0,"",null,null,"",0,""]
[null,{"$f":"IFERROR(INDEX(Plantilla!$C$3:$C$39,MATCH('Consulta de Inscripciones'!B8,Plantilla!$D$3:$D$39,0)),\"\")","v":""},0,"",null,null,"",0,""]
[null,{"$f":"IFERROR(INDEX(Plantilla!$C$3:$C$39,MATCH('Consulta de Inscripciones'!B9,Plantilla!$D$3:$D$39,0)),\"\")","v":""},0,"",null,null,"",0,""]
[null,{"$f":"IFERROR(INDEX(Plantilla!$C$3:$C$39,MATCH('Consulta de Inscripciones'!B10,Plantilla!$D$3:$D$39,0)),\"\")","v":""},0,"",null,null,"",0,""]
[null,{"$f":"IFERROR(INDEX(Plantilla!$C$3:$C$39,MATCH('Consulta de Inscripciones'!B11,Plantilla!$D$3:$D$39,0)),\"\")","v":""},0,"",null,null,"",0,""]
[null,null,0,"",null,null,null,0,""]
[null,null,0,"",null,null,null,0,""]
[null,null,0,"",null,null,null,0,""]
[null,null,0,"",null,null,null,0,""]
[null,null,0,"",null,null,null,0,""]
[null,null,0,"",null,null,null,0,""]
[null,null,0,"",null,null,null,0,""]
[null,null,0,"",null,null,null,0,""]
[null,null,0,"",null,null,null,0,"",""]
[null,null,0,"",null,null,null,0,"",""]
[null,null,0,"",null,null,null,0,"",""]
[null,null,0,"",null,null,null,0,"",""]
[null,null,0,"",null,null,null,0,"",""]
[null,null,0,"",null,null,null,0,"",""]
[null,null,0,"",null,null,null,0,"",""]
[null,null,0,"",null,null,null,0,"",""]
[null,null,0,"",null,null,null,0,"",""]
[null,null,0,"",null,null,null,0,"",""]
[null,null,0,"",null,null,null,0,"",""]
[null,null,0,"",null,null,null,0,"",""]
[null,null,0,"",null,null,null,0,"",""]
[null,{"$f":"IFERROR(INDEX(Plantilla!$C$3:$C$39,MATCH('Consulta de Inscripciones'!B12,Plantilla!$D$3:$D$39,0)),\"\")","v":""},0,"",null,null,"",0,"",""]
[null,{"$f":"IFERROR(INDEX(Plantilla!$C$3:$C$39,MATCH('Consulta de Inscripciones'!B13,Plantilla!$D$3:$D$39,0)),\"\")","v":""},0,"",null,null,"",0,"",""]
[null,{"$f":"IFERROR(INDEX(Plantilla!$C$3:$C$39,MATCH('Consulta de Inscripciones'!B14,Plantilla!$D$3:$D$39,0)),\"\")","v":""},0,"",null,null,"",0,"",""]
[null,{"$f":"IFERROR(INDEX(Plantilla!$C$3:$C$39,MATCH('Consulta de Inscripciones'!B15,Plantilla!$D$3:$D$39,0)),\"\")","v":""},0,"",null,null,"",0,"",""]
[null,{"$f":"IFERROR(INDEX(Plantilla!$C$3:$C$39,MATCH('Consulta de Inscripciones'!B16,Plantilla!$D$3:$D$39,0)),\"\")","v":""},0,"",null,null,"",0,"",""]
[null,{"$f":"IFERROR(INDEX(Plantilla!$C$3:$C$39,MATCH('Consulta de Inscripciones'!B17,Plantilla!$D$3:$D$39,0)),\"\")","v":""},0,"",null,null,"",0,"",""]
[null,{"$f":"IFERROR(INDEX(Plantilla!$C$3:$C$39,MATCH('Consulta de Inscripciones'!B18,Plantilla!$D$3:$D$39,0)),\"\")","v":""},0,"",null,null,"",0,"",""]
[null,{"$f":"IFERROR(INDEX(Plantilla!$C$3:$C$39,MATCH('Consulta de Inscripciones'!B19,Plantilla!$D$3:$D$39,0)),\"\")","v":""},0,"",null,null,"",0,"",""]
[null,{"$f":"IFERROR(INDEX(Plantilla!$C$3:$C$39,MATCH('Consulta de Inscripciones'!B20,Plantilla!$D$3:$D$39,0)),\"\")","v":""},0,"",null,null,"",0,"",""]
[null,{"$f":"IFERROR(INDEX(Plantilla!$C$3:$C$39,MATCH('Consulta de Inscripciones'!B21,Plantilla!$D$3:$D$39,0)),\"\")","v":""},0,"",null,null,"",0,"",""]
[null,{"$f":"IFERROR(INDEX(Plantilla!$C$3:$C$39,MATCH('Consulta de Inscripciones'!B22,Plantilla!$D$3:$D$39,0)),\"\")","v":""},0,"",null,null,"",0,"",""]
[null,{"$f":"IFERROR(INDEX(Plantilla!$C$3:$C$39,MATCH('Consulta de Inscripciones'!B23,Plantilla!$D$3:$D$39,0)),\"\")","v":""},0,"",null,null,"",0,"",""]
[null,{"$f":"IFERROR(INDEX(Plantilla!$C$3:$C$39,MATCH('Consulta de Inscripciones'!B24,Plantilla!$D$3:$D$39,0)),\"\")","v":""},0,"",null,null,"",0,"",""]
[null,{"$f":"IFERROR(INDEX(Plantilla!$C$3:$C$39,MATCH('Consulta de Inscripciones'!B25,Plantilla!$D$3:$D$39,0)),\"\")","v":""},0,"",null,null,"",0,"",""]
[null,{"$f":"IFERROR(INDEX(Plantilla!$C$3:$C$39,MATCH('Consulta de Inscripciones'!B26,Plantilla!$D$3:$D$39,0)),\"\")","v":""},0,"",null,null,"",0,"",""]
[null,{"$f":"IFERROR(INDEX(Plantilla!$C$3:$C$39,MATCH('Consulta de Inscripciones'!B27,Plantilla!$D$3:$D$39,0)),\"\")","v":""},0,"",null,null,"",0,"",""]
[null,{"$f":"IFERROR(INDEX(Plantilla!$C$3:$C$39,MATCH('Consulta de Inscripciones'!B28,Plantilla!$D$3:$D$39,0)),\"\")","v":""},0,"",null,null,"",0,"",""]
[null,{"$f":"IFERROR(INDEX(Plantilla!$C$3:$C$39,MATCH('Consulta de Inscripciones'!B29,Plantilla!$D$3:$D$39,0)),\"\")","v":""},0,"",null,null,"",0,"",""]
[null,{"$f":"IFERROR(INDEX(Plantilla!$C$3:$C$39,MATCH('Consulta de Inscripciones'!B30,Plantilla!$D$3:$D$39,0)),\"\")","v":""},0,"",null,null,"",0,"",""]
[null,{"$f":"IFERROR(INDEX(Plantilla!$C$3:$C$39,MATCH('Consulta de Inscripciones'!B31,Plantilla!$D$3:$D$39,0)),\"\")","v":""},0,"",null,null,"",0,"",""]
[null,{"$f":"IFERROR(INDEX(Plantilla!$C$3:$C$39,MATCH('Consulta de Inscripciones'!B32,Plantilla!$D$3:$D$39,0)),\"\")","v":""},0,"",null,null,"",0,""]

{"sheet":"Precios Carreras","index":16,"n_rows":13,"n_cols":2,"rows_kept":13,"cut":false,"hidden":false,"merged":[[0,0,0,1]]}
["volver"]
[1.1000000000000001,1200]
[2.1,1600]
["1.HC",4800]
["1.UWT",8000]
["2.UWT",8000]
["GV",100000]
["HC",6000]
["WC ITT",2000]
["WC RR",6000]
["WC TTT",2000]
["tc",1500]
["tv",2000]

{"sheet":"Premios Carreras","index":17,"n_rows":219,"n_cols":6,"rows_kept":219,"cut":false,"hidden":false,"merged":[[0,0,0,3]]}
["volver"]
["Puesto","General","Secundarias","Etapa"]
["GV 1",300000,23000,800,300,23]
["GV 2",150000,16000,500,150,16]
["GV 3",80000,8000,300,80,8]
["GV 4",60000,4000,null,60,4]
["GV 5",40000,3500,null,40,3.5]
["GV 6",22000,3000,null,22,3]
["GV 7",11000,2500,null,11,2.5]
["GV 8",7600,2000,null,7.6,2]
["GV 9",4500,1600,null,4.5,1.6]
["GV 10",3800,1000,null,3.8,1]
["GV 11",3000,null,null,3]
["GV 12",2700,null,null,2.7]
["GV 13",2400,null,null,2.4]
["GV 14",2100,null,null,2.1]
["GV 15",1800,null,null,1.8]
["GV 16",1500,null,null,1.5]
["GV 17",1350,null,null,1.35]
["GV 18",1200,null,null,1.2]
["GV 19",1050,null,null,1.05]
["GV 20",975,null,null,975]
["GV 21",900,null,null,900]
["GV 22",825,null,null,825]
["GV 23",750,null,null,750]
["GV 24",675,null,null,675]
["GV 25",600,null,null,600]
["GV 26",570,null,null,570]
["GV 27",570,null,null,570]
["GV 28",570,null,null,570]
["GV 29",570,null,null,570]
["GV 30",570,null,null,570]
["2.UWT 1",30000,3000,420,50,5]
["2.UWT 2",15000,1800,300,25,3]
["2.UWT 3",9000,1200,180,15,2]
["2.UWT 4",7200,900,null,12,1.5]
["2.UWT 5",6000,600,null,10,1]
["2.UWT 6",4800,300,null,8,500]
["2.UWT 7",3300,null,null,5.5]
["2.UWT 8",2100,null,null,3.5]
["2.UWT 9",1500,null,null,2.5]
["2.UWT 10",1050,null,null,1.75]
["2.UWT 11",750,null,null,1.25]
["2.UWT 12",600,null,null,1]
["2.UWT 13",480,null,null,800]
["2.UWT 14",420,null,null,700]
["2.UWT 15",360,null,null,600]
["2.UWT 16",270,null,null,450]
["2.UWT 17",270,null,null,450]
["2.UWT 18",270,null,null,450]
["2.UWT 19",270,null,null,450]
["2.UWT 20",270,null,null,450]
["2.UWT 21",270,null,null,450]
["2.UWT 22",270,null,null,450]
["2.UWT 23",270,null,null,450]
["2.UWT 24",270,null,null,450]
["2.UWT 25",270,null,null,450]
["2.HC 1",6000,1500,270,10,2.5]
["2.HC 2",3000,900,180,5,1.5]
["2.HC 3",1800,720,90,3,1.2]
["2.HC 4",1200,600,60,2,1]
["2.HC 5",900,300,null,1.5,500]
["2.HC 6",750,null,null,1.25]
["2.HC 7",600,null,null,1]
["2.HC 8",480,null,null,800]
["2.HC 9",420,null,null,700]
["2.HC 10",360,null,null,600]
["2.HC 11",300,null,null,500]
["2.HC 12",240,null,null,400]
["2.HC 13",210,null,null,350]
["2.HC 14",210,null,null,350]
["2.HC 15",120,null,null,200]
["2.HC 16",120,null,null,200]
["2.HC 17",120,null,null,200]
["2.HC 18",120,null,null,200]
["2.HC 19",120,null,null,200]
["2.HC 20",120,null,null,200]
["2.1 1",4500,900,210,7.5,1.5]
["2.1 2",2100,600,150,3.5,1]
["2.1 3",1500,300,90,2.5,500]
["2.1 4",900,null,null,1.5]
["2.1 5",750,null,null,1.25]
["2.1 6",600,null,null,1]
["2.1 7",480,null,null,800]
["2.1 8",360,null,null,600]
["2.1 9",300,null,null,500]
["2.1 10",240,null,null,400]
["2.1 11",180,null,null,300]
["2.1 12",165,null,null,275]
["2.1 13",150,null,null,250]
["2.1 14",135,null,null,225]
["2.1 15",120,null,null,200]
["2.1 16",90,null,null,150]
["2.1 17",90,null,null,150]
["2.1 18",90,null,null,150]
["2.1 19",90,null,null,150]
["2.1 20",90,null,null,150]
["1.UWT 1",24000,null,null,40]
["1.UWT 2",12000,null,null,20]
["1.UWT 3",9720,null,null,16.2]
["1.UWT 4",7200,null,null,12]
["1.UWT 5",6000,null,null,10]
["1.UWT 6",4800,null,null,8]
["1.UWT 7",3600,null,null,6]
["1.UWT 8",3000,null,null,5]
["1.UWT 9",2400,null,null,4]
["1.UWT 10",1800,null,null,3]
["1.UWT 11",1200,null,null,2]
["1.UWT 12",1080,null,null,1.8]
["1.UWT 13",960,null,null,1.6]
["1.UWT 14",840,null,null,1.4]
["1.UWT 15",720,null,null,1.2]
["1.UWT 16",600,null,null,1]
["1.UWT 17",600,null,null,1]
["1.UWT 18",600,null,null,1]
["1.UWT 19",600,null,null,1]
["1.UWT 20",600,null,null,1]
["1.UWT 21",360,null,null,600]
["1.UWT 22",360,null,null,600]
["1.UWT 23",360,null,null,600]
["1.UWT 24",360,null,null,600]
["1.UWT 25",360,null,null,600]
["1.HC 1",9000,null,null,15]
["1.HC 2",4800,null,null,8]
["1.HC 3",3600,null,null,6]
["1.HC 4",2700,null,null,4.5]
["1.HC 5",2100,null,null,3.5]
["1.HC 6",1800,null,null,3]
["1.HC 7",1500,null,null,2.5]
["1.HC 8",1200,null,null,2]
["1.HC 9",900,null,null,1.5]
["1.HC 10",720,null,null,1.2]
["1.HC 11",540,null,null,900]
["1.HC 12",480,null,null,800]
["1.HC 13",420,null,null,700]
["1.HC 14",360,null,null,600]
["1.HC 15",300,null,null,500]
["1.HC 16",240,null,null,400]
["1.HC 17",240,null,null,400]
["1.HC 18",240,null,null,400]
["1.HC 19",240,null,null,400]
["1.HC 20",240,null,null,400]
["1.HC 21",150,null,null,250]
["1.HC 22",150,null,null,250]
["1.HC 23",150,null,null,250]
["1.HC 24",150,null,null,250]
["1.HC 25",150,null,null,250]
["1.1 1",2100,null,null,8]
["1.1 2",1200,null,null,5]
["1.1 3",900,null,null,3]
["1.1 4",720,null,null,1.5]
["1.1 5",600,null,null,1]
["1.1 6",480,null,null,750]
["1.1 7",420,null,null,700]
["1.1 8",360,null,null,650]
["1.1 9",300,null,null,600]
["1.1 10",270,null,null,550]
["1.1 11",210,null,null,550]
["1.1 12",180,null,null,520]
["1.1 13",150,null,null,490]
["1.1 14",135,null,null,460]
["1.1 15",120,null,null,430]
["1.1 16",75,null,null,400]
["1.1 17",75,null,null,370]
["1.1 18",75,null,null,340]
["1.1 19",75,null,null,340]
["1.1 20",75,null,null,340]
["WC TTT 1",4000,null,null,325]
["WC TTT 2",2000,null,null,325]
["WC TTT 3",1200,null,null,325]
["WC TTT 4",800,null,null,325]
["WC ITT 1",4000,null,null,325]
["WC ITT 2",2400,null,null,3.5]
["WC ITT 3",1200,null,null,2]
["WC ITT 4",800,null,null,1.5]
["WC ITT 5",640,null,null,1.2]
["WC ITT 6",600,null,null,1]
["WC ITT 7",560,null,null,800]
["WC ITT 8",520,null,null,700]
["WC RR 1",9000,null,null,600]
["WC RR 2",6000,null,null,500]
["WC RR 3",4000,null,null,450]
["WC RR 4",2000,null,null,350]
["WC RR 5",1500,null,null,300]
["WC RR 6",1000,null,null,250]
["WC RR 7",800,null,null,225]
["WC RR 8",700,null,null,200]
["WC RR 9",600,null,null,125]
["WC RR 10",500,null,null,125]
["WC RR 11",500,null,null,125]
["WC RR 12",500,null,null,125]
["WC RR 13",500,null,null,125]
["WC RR 14",500,null,null,5]
["WC RR 15",500,null,null,2.5]
["mce3",{"$f":"E195*1000","v":1500},null,null,1.5]
["mce4",1000,null,null,1]
["mci1",5000,null,null,5]
["mci2",3000,null,null,3]
["mci3",1500,null,null,1.5]
["mci4",1000,null,null,1]
["mci5",{"$f":"E201","v":800},null,null,800]
["mci6",{"$f":"E202","v":750},null,null,750]
["mci7",{"$f":"E203","v":700},null,null,700]
["mci8",{"$f":"E204","v":650},null,null,650]
["mrc1",{"$f":"E205*1000","v":9000},null,null,9]
["mrc2",6000,null,null,6]
["mrc3",4000,null,null,4]
["mrc4",2000,null,null,2]
["mrc5",1500,null,null,1.5]
["mrc6",1000,null,null,1]
["mrc7",{"$f":"E211","v":800},null,null,800]
["mrc8",700,null,null,700]
["mrc9",600,null,null,600]
["mrc10",500,null,null,500]
["mrc11",500,null,null,500]
["mrc12",500,null,null,500]
["mrc13",500,null,null,500]
["mrc14",500,null,null,500]
["mrc15",500,null,null,500]

{"sheet":"Tipos de Corredor","index":18,"n_rows":6,"n_cols":2,"rows_kept":6,"cut":false,"hidden":false,"merged":[[0,0,0,1]]}
["Plantilla"]
["Esprinter",2]
["Gregario",4]
["Libre",3]
["Lider",1]
[{"$f":"\"\"","v":""},5]

{"sheet":"Version","index":19,"n_rows":4,"n_cols":4,"rows_kept":4,"cut":false,"hidden":true,"merged":[]}
[]
[]
[]
[null,null,null,"Hola, esta hoja esta hecha para llevar el equipo "]

{"sheet":"Meses","index":20,"n_rows":14,"n_cols":2,"rows_kept":14,"cut":false,"hidden":false,"merged":[]}
[null,"Meses"]
[null,"volver"]
[null,"E"]
[null,"F"]
[null,"M"]
[null,"A"]
[null,"My"]
[null,"J"]
[null,"Jl"]
[null,"Ag"]
[null,"S"]
[null,"O"]
[null,"N"]
[null,"D"]

{"sheet":"Sucio","index":21,"n_rows":63,"n_cols":9,"rows_kept":63,"cut":false,"hidden":true,"merged":[]}
[" 22.01.2013 - 27.01.2013 -- Santos Tour Down Under (6 Dias) -- TV",null,null,null,null,null,null,"Santos Tour Down Under (6 Dias) -- TV"]
[" 27.01.2013 - 27.01.2013 -- Rund um den Finanzplatz Eschborn - Frankfurt (1 Dia) -- PC",null,null,null,null,null,null,"Rund um den Finanzplatz Eschborn - Frankfurt (1 Dia) -- PC"]
[" 29.01.2013 - 29.01.2013 -- Strade Bianche (1 Dia) -- TC",null,null,null,null,null,null,"Strade Bianche (1 Dia) -- TC"]
[" 01.02.2013 - 01.02.2013 -- Giro del Piemonte (1 Dia) -- PC",null,null,null,null,null,null,"Giro del Piemonte (1 Dia) -- PC"]
[" 06.02.2013 - 13.02.2013 -- Paris-Niza (8 Dias) -- MV",null,null,null,null,null,null,"Paris-Niza (8 Dias) -- MV"]
[" 07.02.2013 - 07.02.2013 -- Omloop Het Niewsblad (1 Día) -- TC",null,null,null,null,null,null,"Omloop Het Niewsblad (1 Día) -- TC"]
[" 15.02.2013 - 15.02.2013 -- Milan - San Remo (1 Día) -- GC",null,null,null,null,null,null,"Milan - San Remo (1 Día) -- GC"]
[" 15.02.2013 - 15.02.2013 -- Gran Premio Miguel Indurain (1 Dia) -- PC",null,null,null,null,null,null,"Gran Premio Miguel Indurain (1 Dia) -- PC"]
[" 17.02.2013 - 17.02.2013 -- Grand Prix Cyclist de Québec (1 Día) -- MC",null,null,null,null,null,null,"Grand Prix Cyclist de Québec (1 Día) -- MC"]
[" 17.02.2013 - 17.02.2013 -- Tro-Bro Léon (1 Día) -- PC",null,null,null,null,null,null,"Tro-Bro Léon (1 Día) -- PC"]
[" 19.02.2013 - 13.03.2013 -- Giro d'Italia (21 Días) -- GV",null,null,null,null,null,null,"Giro d'Italia (21 Días) -- GV"]
[" 26.02.2013 - 26.02.2013 -- E3 Prijs Vlaanderen - Harelbeke (1 Día) -- MC",null,null,null,null,null,null,"E3 Prijs Vlaanderen - Harelbeke (1 Día) -- MC"]
[" 12.03.2013 - 17.03.2013 -- Pais Vasco (6 Dias) -- TV",null,null,null,null,null,null,"Pais Vasco (6 Dias) -- TV"]
[" 18.03.2013 - 18.03.2013 -- GP Kranj (1 Dia) -- PC",null,null,null,null,null,null,"GP Kranj (1 Dia) -- PC"]
[" 18.03.2013 - 18.03.2013 -- Nokere - Koerse (1Dia) -- PC",null,null,null,null,null,null,"Nokere - Koerse (1Dia) -- PC"]
[" 20.03.2013 - 20.03.2013 -- Ronde Van Vlaanderen - Tour de Flandes (1 Día) -- GC",null,null,null,null,null,null,"Ronde Van Vlaanderen - Tour de Flandes (1 Día) -- GC"]
[" 21.03.2013 - 21.03.2013 -- Amstel Gold Race - Maastricht (1 Día) -- MC",null,null,null,null,null,null,"Amstel Gold Race - Maastricht (1 Día) -- MC"]
[" 23.03.2013 - 30.03.2013 -- Criterium du Dauphine (8 Dias) -- MV",null,null,null,null,null,null,"Criterium du Dauphine (8 Dias) -- MV"]
[" 26.03.2013 - 26.03.2013 -- Flèche Wallone (1 Día) -- MC",null,null,null,null,null,null,"Flèche Wallone (1 Día) -- MC"]
[" 30.03.2013 - 30.03.2013 -- Paris - Tours (1 Dia) -- TC",null,null,null,null,null,null,"Paris - Tours (1 Dia) -- TC"]
[" 01.04.2013 - 01.04.2013 -- Dwars door Vlaanderen (1 Dia) -- PC",null,null,null,null,null,null,"Dwars door Vlaanderen (1 Dia) -- PC"]
[" 05.04.2013 - 05.04.2013 -- Liège-Bastogne-Liège (1 Día) -- GC",null,null,null,null,null,null,"Liège-Bastogne-Liège (1 Día) -- GC"]
[" 06.04.2013 - 28.04.2013 -- Tour de Francia (21 Dias) -- GV",null,null,null,null,null,null,"Tour de Francia (21 Dias) -- GV"]
[" 14.04.2013 - 14.04.2013 -- Vattenfall Cyclassics (1 Día) -- MC",null,null,null,null,null,null,"Vattenfall Cyclassics (1 Día) -- MC"]
[" 25.04.2013 - 02.05.2013 -- Eneco Tour (8 Dias) -- TV",null,null,null,null,null,null,"Eneco Tour (8 Dias) -- TV"]
[" 02.05.2013 - 02.05.2013 -- GP Ouest France - Plouay (1 Dia) -- MC",null,null,null,null,null,null,"GP Ouest France - Plouay (1 Dia) -- MC"]
[" 03.05.2013 - 03.05.2013 -- Clásica de San Sebastián (1 Día) -- MC",null,null,null,null,null,null,"Clásica de San Sebastián (1 Día) -- MC"]
[" 05.05.2013 - 05.05.2013 -- Paris-Roubaix (1 Día) -- GC",null,null,null,null,null,null,"Paris-Roubaix (1 Día) -- GC"]
[" 07.05.2013 - 07.05.2013 -- Grand Prix Cycliste de Montreal (1 Dia) -- TC",null,null,null,null,null,null,"Grand Prix Cycliste de Montreal (1 Dia) -- TC"]
[" 10.05.2013 - 10.05.2013 -- Ronde van Drenthe (1 Dia) -- PC",null,null,null,null,null,null,"Ronde van Drenthe (1 Dia) -- PC"]
[" 11.05.2013 - 15.05.2013 -- Vuelta a Burgos (5 Dias) -- PV",null,null,null,null,null,null,"Vuelta a Burgos (5 Dias) -- PV"]
[" 11.05.2013 - 11.05.2013 -- Paris - Bruxelles (1 Dia) -- TC",null,null,null,null,null,null,"Paris - Bruxelles (1 Dia) -- TC"]
[" 13.05.2013 - 13.05.2013 -- CN Sur de Europa: Contrarreloj Individual (1 Dia) CN",null,null,null,null,null,null,"CN Sur de Europa: Contrarreloj Individual (1 Dia) CN"]
[" 13.05.2013 - 13.05.2013 -- CN Este de Europa: Contrarreloj Individual (1 Dia) CN",null,null,null,null,null,null,"CN Este de Europa: Contrarreloj Individual (1 Dia) CN"]
[" 13.05.2013 - 13.05.2013 -- CN Norte de Europa: Contrarreloj Individual (1 Dia) CN",null,null,null,null,null,null,"CN Norte de Europa: Contrarreloj Individual (1 Dia) CN"]
[" 13.05.2013 - 13.05.2013 -- CN America: Contrarreloj Individual (1 Dia) CN",null,null,null,null,null,null,"CN America: Contrarreloj Individual (1 Dia) CN"]
[" 13.05.2013 - 13.05.2013 -- CN Resto del Mundo: Contrarreloj Individual (1 Dia) CN",null,null,null,null,null,null,"CN Resto del Mundo: Contrarreloj Individual (1 Dia) CN"]
[" 15.05.2013 - 15.05.2013 -- CN Sur de Europa: Ruta en Carretera (1 Dia) CN",null,null,null,null,null,null,"CN Sur de Europa: Ruta en Carretera (1 Dia) CN"]
[" 15.05.2013 - 15.05.2013 -- CN Este de Europa: Ruta en Carretera (1 Dia) CN",null,null,null,null,null,null,"CN Este de Europa: Ruta en Carretera (1 Dia) CN"]
[" 15.05.2013 - 15.05.2013 -- CN Norte de Europa: Ruta en Carretera (1 Dia) CN",null,null,null,null,null,null,"CN Norte de Europa: Ruta en Carretera (1 Dia) CN"]
[" 15.05.2013 - 15.05.2013 -- CN America: Ruta en Carretera (1 Dia) CN",null,null,null,null,null,null,"CN America: Ruta en Carretera (1 Dia) CN"]
[" 15.05.2013 - 15.05.2013 -- CN Resto del Mundo: Ruta en Carretera (1 Dia) CN",null,null,null,null,null,null,"CN Resto del Mundo: Ruta en Carretera (1 Dia) CN"]
[" 17.05.2013 - 17.05.2013 -- Milano - Torino (1 Dia) -- TC",null,null,null,null,null,null,"Milano - Torino (1 Dia) -- TC"]
[" 17.05.2013 - 17.05.2013 -- Il Lombardía - Clasica de Lombardia (1 Día) -- GC",null,null,null,null,null,null,"Il Lombardía - Clasica de Lombardia (1 Día) -- GC"]
[" 19.05.2013 - 10.06.2013 -- Vuelta españa (21 Dias) -- GV",null,null,null,null,null,null,"Vuelta españa (21 Dias) -- GV"]
[" 22.05.2013 - 22.05.2013 -- Flèche Brabançonne (1 Día) -- TC",null,null,null,null,null,null,"Flèche Brabançonne (1 Día) -- TC"]
[" 09.06.2013 - 12.06.2013 -- Giro del Trentino (4 Dias) -- PV",null,null,null,null,null,null,"Giro del Trentino (4 Dias) -- PV"]
[" 13.06.2013 - 17.06.2013 -- Tour of Beijing (5 Dias) -- TV",null,null,null,null,null,null,"Tour of Beijing (5 Dias) -- TV"]
[" 17.06.2013 - 17.06.2013 -- Chrono des Nations (1 Día) -- PC",null,null,null,null,null,null,"Chrono des Nations (1 Día) -- PC"]
[" 19.06.2013 - 19.06.2013 -- Japan Cup (1 Dia) -- PC",null,null,null,null,null,null,"Japan Cup (1 Dia) -- PC"]
[" 21.06.2013 - 21.06.2013 -- Gante-Wevelgen (1 Día) -- MC",null,null,null,null,null,null,"Gante-Wevelgen (1 Día) -- MC"]
[" 23.06.2013 - 23.06.2013 -- Campeonatos del Mundo: Contrarreloj por Equipos (1 Día) -- MCE",null,null,null,null,null,null,"Campeonatos del Mundo: Contrarreloj por Equipos (1 Día) -- MCE"]
[" 24.06.2013 - 24.06.2013 -- Campeonatos del Mundo: Contrarreloj Individual (1 Día) -- MCI",null,null,null,null,null,null,"Campeonatos del Mundo: Contrarreloj Individual (1 Día) -- MCI"]
[" 25.06.2013 - 25.06.2013 -- Campeonatos del Mundo: Ruta en Carretera (1 Día) -- MRC",null,null,null,null,null,null,"Campeonatos del Mundo: Ruta en Carretera (1 Día) -- MRC"]
[]
[]
[]
[]
[]
[]
[null,null,null,null,null,null,null,null,"[13:08:16] @ samu12 : http://www.youtube.com/watch?v=K854Q8WuIvs"]
[null,null,null,null,null,null,null,null,"[13:08:35] @ samu12 : http://www.youtube.com/watch?v=ilRn6vsxAjw"]
[null,null,null,null,null,null,null,null,"[13:09:12] @ samu12 : http://www.youtube.com/watch?v=3JwcS_k5P8g"]